{"text_format":"1","workbook":"xlsx","n_sheets":4,"sheets":["ajantasaiset palkat","Taul2","Käyttöohje","Laskuri"],"not_rendered":{"charts":0,"images":0,"macros":1,"external_links":0,"defined_names":18,"comments":0,"pivot_tables":0},"unopened":[],"bounds":{"document_bytes":16777216,"sheet_cells":100000,"rows_first":2000,"rows_last":500,"rows_between":2000,"halvings":0,"cell_chars":16384,"cell_head_chars":4096},"cells_cut":0,"cells_raw":0,"read":"row_number_cap","date_system":"1900"}

{"sheet":"ajantasaiset palkat","index":0,"n_rows":307,"n_cols":9,"rows_kept":307,"cut":false,"hidden":true,"merged":[[78,3,78,5],[78,6,78,8],[0,0,0,1],[5,3,5,5],[5,6,5,8],[46,3,46,5],[46,6,46,8],[58,3,58,5],[127,3,127,5],[127,6,127,8],[131,3,131,5],[131,6,131,8],[135,3,135,5],[135,6,135,8],[141,3,141,5],[141,6,141,8],[145,3,145,5],[145,6,145,8],[149,3,149,5],[149,6,149,8],[155,6,155,8],[189,3,189,5],[189,6,189,8],[236,3,236,5],[236,6,236,8],[281,3,281,5],[281,6,281,8],[293,3,293,5],[293,6,293,8],[58,6,58,8],[71,3,71,5],[71,6,71,8],[115,3,115,5],[115,6,115,8],[287,3,287,5],[287,6,287,8],[247,3,247,5],[247,6,247,8],[269,3,269,5],[269,6,269,8],[155,3,155,5]]}
["SIVISTYSTYÖNANTAJAT ry"]
["Opetushenkilöstön palkat  (muut kuin AMK)"]
["1.8.2015 lukien "]
[]
["LUKIO-OPETUS JA PERUSOPETUS"]
["Tilastokoodi",null,null,"I kalleusluokka ",null,null,"II kalleusluokka "]
["011064","Peruskoulun rehtori (64 - 68)",null,3718.33,"-",4426.71,3615.93,"-",4304.7700000000004]
["011065","Lukion rehtori (65 - 70)",null,3875.9,"-",4861.28,3769.19,"-",4727.54]
[]
[null,null,null,"I kalleusluokka ",null,"II kalleusluokka "]
["011261","Johtaja (61)",null,3239.88,null,3150.8]
["011259","Johtaja (59)",null,3027.13,null,2944.12]
["011154","Apulaisjohtaja (54)",null,2488.81,null,2420.4699999999998]
[]
["1. Lehtori ja opinto-ohjaaja(lukio)",null,null,"I kalleusluokka ",null,"II kalleusluokka "]
["012151","a. Ylempi korkeakoulututkinto ja lukio-opetusta antavan \nopettajan kelpoisuus taikka aiempi vanhemman lehtorin kelpoisuus (51)",null,2927.19,null,2846.48]
["012150","b. Perusopetusta antavan opettajan tai aiempi lukio-opetusta \nantavan opettajan kelpoisuus (50)",null,2814.38,null,2737.2]
["012145","c. Ylempi tai alempi korkeakoulututkinto (45)",null,2410.91,null,2353.0300000000002]
["012139","d. Muu kuin edellä mainittu (39) ",null,2048.3000000000002,null,2002.02]
["                                                       "]
["2. Lehtori (peruskoulu)"]
["012249","a. Ylempi korkeakoulututkinto ja perus-/lukio-opetusta antavan\n opettajan kelpoisuus tai aiempi vanhemman lehtorin kelpoisuus (49)",null,2724.33,null,2651.32]
["012248","b. Perusopetusta antavan opettajan tai aiempi peruskoulun/lukion opettajan kelpoisuus (48)",null,2611.5300000000002,null,2543.84]
["012244","c. Ylempi korkeakoulututkinto (44)",null,2287.25,null,2233.0100000000002]
["012242","d. Alempi korkeakoulututkinto (42)",null,2181.1999999999998,null,2129.58]
["012239","e. Muu kuin edellä mainittu (39)",null,2048.3000000000002,null,2002.02]
[]
["3. Erityisopettaja ja erityisluokanopettaja"]
["012349","a. Ylempi korkeakoulututkinto ja erityisopetusta antavan opettajan kelpoisuus (49)",null,2724.33,null,2651.32]
["012348","b. Alempi korkeakoulututkinto ja erityisopetusta antavan opettajan kelpoisuus (48)",null,2611.5300000000002,null,2543.84]
["012347","c. Erityisopetusta antavan opettajan kelpoisuus taikka ylempi korkeakoulututkinto\n ja perus-/lukio-opetusta antavan opettajan kelpoisuus (47)",null,2552,null,2488.02]
["012346","d. Perus-/lukio-opetusta antavan opettajan kelpoisuus (46)",null,2463.06,null,2402.4299999999998]
["012341","e. Muu kuin edellä mainittu (41)",null,2139.48,null,2089.13]
[]
["f. Muita määräyksiä"]
["012341","Jos vaikeimmin kehitysvammaisten opettajalla on soveltuva\n  vähintään opistoasteinen tutkinto (41), on hänen peruspalkkansa",null,2139.48,null,2089.13]
["012344","ja jos hänellä on lisäksi 35 opintoviikon erityisopinnot (44), ",null,2287.25,null,2233.0100000000002]
[]
["4. Luokanopettaja"]
["012449","a. Ylempi korkeakoulututkinto, aineen opettajan kelpoisuus  sekä perus-/lukio-opetusta antavan opettajan kelpoisuus (49)",null,2724.33,null,2651.32]
["012448","b. Aineenopettajan kelpoisuus ja perus/lukio-opetusta antavan opettajan kelpoisuus (48), ",null,2611.5300000000002,null,2543.84]
["012446","c. Perus/lukio-opetusta antavan opettajan kelpoisuus (46), ",null,2463.06,null,2402.4299999999998]
["012435","d. Muu kuin edellä mainittu (35)",null,1911.48,null,1868.95]
[]
[]
["12 § Oppilaan ohjauksen lehtori"]
[null,"Ylempi korkeakoulututkinto ja perus-/lukio-opetusta antavan opettajan kelpoisuus taikka aiempi vanhemman lehtorin kelpoisuus ",null,"I kalleusluokka ",null,null,"II kalleusluokka "]
["015156","- määrävuosilisään oikeuttavaa aikaa alle 15 vuotta (56 - 59)",null,2840.92," -",3087.68,2763.04," -",3003]
["015159","- määrävuosilisään oikeuttavaa aikaa vähintään 15 vuotta (59 - 63)",null,3087.68," -",3572.85,3003," -",3474.52]
[null,"Perus-/lukio-opetusta antavan opettajan kelpoisuus"]
["015155","- määrävuosilisään oikeuttavaa aikaa alle 15 vuotta (55 - 58)",null,2776.7," -",2997.97,2700.41," -",2915.33]
["015158","- määrävuosilisään oikeuttavaa aikaa vähintään 15 vuotta (58 - 61)",null,2997.97," -",3304.67,2915.33," -",3213.8]
[null,"Muu kuin edellä mainittu"]
["015143","- määrävuosilisään oikeuttavaa aikaa alle 15 vuotta (43 - 50)",null,1944," -",2283.58,1899.65," -",2220.9299999999998]
["015146","- määrävuosilisään oikeuttavaa aikaa vähintään 15 vuotta (46 - 53)",null,2069.2399999999998," -",2471.61,2018.28," -",2403.7600000000002]
[]
[]
["AIKUISLUKIO JA LUKION AIKUISLINJA"]
[null,null,null,"I kalleusluokka ",null,null,"II kalleusluokka "]
["011065","Aikuislukion ja lukion aikuislinjan rehtori (65 - 70)",null,3875.9,"-",4861.28,3769.19,"-",4727.54]
[]
["1. Aikuislukion lehtori ",null,null,"I kalleusluokka ",null,"II kalleusluokka "]
["012151","a. Ylempi korkeakoulututkinto ja lukio-opetusta antavan opettajan kelpoisuus taikka aiempi vanhemman lehtorin kelpoisuus (51)",null,2927.19,null,2846.48]
["012150","b. Perusopetusta antavan opettajan tai aiempi lukio-opetusta antavan opettajan kelpoisuus (50)",null,2814.38,null,2737.2]
["012145","c. Ylempi tai alempi korkeakoulututkinto (45)",null,2410.91,null,2353.0300000000002]
["012139","d. Muu kuin edellä mainittu (39)",null,2048.3000000000002,null,2002.02]
[]
["                                                       "]
["VAPAAN SIVISTYSTYÖN OPPILAITOKSET"]
[]
["KANSANOPISTOT"]
[null,null,null,"I kalleusluokka ",null,null,"II kalleusluokka "]
["021060","Kansanopiston rehtori (60 - 63)",null,3313.91,"-",3702.23,3222.39,"-",3600.3]
[null,null,null,"I kalleusluokka ",null,"II kalleusluokka "]
["022650","1) ylempi korkeakoulututkinto (50)",null,2516.92,null,2447.91]
["022645","2) Opetustoimen henkilöstön kelpoisuusvaatimuksista annetun asetuksen 18 §:ssä tarkoitettu muu kelpoisuus 27 §:n siirtymäsäännös huomioiden tai erivapauden nojalla vapaan sivistys-työn opettajan kelpoisuuden saanut henkilö (45)",null,2177.9699999999998,null,2125.6999999999998]
[]
["KOKONAISTYÖAJASSA OLEVAT KANSANOPISTOT"]
[]
[]
[]
[]
[]
[]
[]
[]
[]
[]
[]
[]
[]
[]
[]
[]
[]
[]
[]
[]
[]
[]
[]
[]
[]
[]
[]
[]
[]
[]
[]
[]
[]
[]
[]
[]
["KANSALAIS- JA TYÖVÄENOPISTOT"]
[null,null,null,"I kalleusluokka ",null,null,"II kalleusluokka "]
["021060","Kansalais- ja työväenopiston rehtori (60 - 63)",null,3189.33," -",3563.04,3101.25," -",3464.95]
["021061","Rehtorille, jolla on ylempi korkeakoulututkinto tai jolla on rehtori- tai johtajapalvelua vähintään 5 vuotta ",null,3295.59," -",3718.33,3204.98," -",3615.93]
["021159","Kokonaispalkkauksessa oleva apulaisrehtori (59 - 60)",null,3157.96," -",3254.64,3071.37," -",3164.76]
["OPETTAJAT",null,null,"I kalleusluokka ",null,"II kalleusluokka "]
["022650","1) ylempi korkeakoulututkinto (50)",null,2516.92,null,2447.91]
["022645","2) toimeen soveltuva alempi korkeakoulututkinto, ammattikorkeakoulututkinto tai opistoasteen tutkinto tai erivapauden nojalla opettajan toimeen kelpoisuuden saanut (45)",null,2177.9699999999998,null,2125.6999999999998]
[]
["TUNTIOPETTAJAT (kansanopistojen, kansalais- ja työväenopistojen) sekä opintokeskukset "]
[]
["Tuntiopettajan tuntipalkkiot:"]
[]
[null,null,null,"I kalleusluokka",null,null,"II kalleusluokka"]
[null,null,null,"A-palkkio",null,"B-palkkio","A-palkkio",null,"B-palkkio"]
[null,null,null,"022942",null,"022946","022942",null,"022946"]
[null,"A) ylemmän korkeakoulututkinnon tai ylempi AMK-tutkinnon suorittanut tuntiopettaja",null,27.43,null,29.78,26.8,null,29.07]
[null,null,null,"I kalleusluokka",null,null,"II kalleusluokka"]
[null,null,null,"A-palkkio",null,"B-palkkio","A-palkkio",null,"B-palkkio"]
[null,null,null,"022939",null,"022943","022939",null,"022943"]
[null,"B) alemman korkeakoulututkinnon, ammattikorkeakoulututkinnon, voimistelun-, kuvaamataidon-, musiikin-, kotitalous-, kotiteollisuus- ja käsityönopettajan tutkinnon suorittanut tai opistoinsinöörin tutkinnon  suorittanut tuntiopettaja",null,26.04,null,27.97,25.42,null,27.32]
[null,null,null,"I kalleusluokka",null,null,"II kalleusluokka"]
[null,null,null,"A-palkkio",null,"B-palkkio","A-palkkio",null,"B-palkkio"]
[null,null,null,"022937",null,"022941","022937",null,"022941"]
[null,"C) muu tuntiopettaja",null,25.26,null,26.96,24.69,null,26.29]
[]
["Opintokeskusten tuntiopettajien tuntipalkkiot"]
[null,null,null,"I kalleusluokka",null,null,"II kalleusluokka"]
[null,null,null,"A-palkkio",null,"B-palkkio","A-palkkio",null,"B-palkkio"]
[null,null,null,"022941",null,"022945","022941",null,"022945"]
[null,"D) ylemmän korkeakoulututkinnon tai ylemmän AMK-tutkinnon suorittanut tuntiopettaja",null,26.96,null,29.15,26.29,null,28.47]
[null,null,null,"I kalleusluokka",null,null,"II kalleusluokka"]
[null,null,null,"A-palkkio",null,"B-palkkio","A-palkkio",null,"B-palkkio"]
[null,null,null,"022938",null,"022942","022938",null,"022942"]
[null,"E) alemman korkeakoulututkinnon, ammattikorkeakoulututkinnon, voimistelun-, kuvaamataidon-, musiikin-, kotitalous-, kotiteollisuus- ja käsityönopettajan tutkinnon suorittanut tai opistoinsinöörin tutkinnon suorittanut tuntiopettaja",null,25.65,null,27.43,25.06,null,26.8]
[null,null,null,"I kalleusluokka",null,null,"II kalleusluokka"]
[null,null,null,"A-palkkio",null,"B-palkkio","A-palkkio",null,"B-palkkio"]
[null,null,null,"022936",null,"022940","022936",null,"022940"]
[null,"F) muu tuntiopettaja",null,24.97,null,26.49,24.41,null,25.85]
[]
["URHEILUOPISTOT"]
[]
[]
[]
[]
[]
[]
[]
[]
[]
[]
[]
[]
[]
[]
[]
[]
[]
[]
[]
[]
[]
[]
[]
[]
[]
[]
[]
[]
[]
[]
[]
[]
["MUSIIKKIOPPILAITOKSET"]
[]
["Rehtori",null,null,"I kalleusluokka ",null,null,"II kalleusluokka "]
["041061","- ylempi korkeakoulututkinto tai ylempi AMK-tutkinto (61 - 66) ",null,3528.25," -",4323.1000000000004,3431.24," -",4203.74]
["041060","- muu tutkinto (60 - 65) ",null,3414.49," -",4149.5600000000004,3320.19," -",4035.3]
[]
["Apulaisrehtori "]
["041159","- ylempi korkeakoulututkinto tai ylempi AMK-tutkinto (59 - 63)",null,3237.62," -",3746.38,3148.84," -",3643.24]
["041158","- muu tutkinto (58 - 62)",null,3143.57," -",3600.26,3056.93," -",3501.44]
[]
["1. Konservatorio"]
["043152","a. Yliopettaja (52 - 54)",null,2712.43," -",2893.7,2637.67," -",2814.25]
["043249","b. Lehtori - ylempi KK tai ylempi AMK-tutkinto (49 - 51)",null,2501.27," -",2650.44,2434.23," -",2577.34]
["043248","c. Lehtori (48 - 50)",null,2328.14," -",2558.89,2267.77," -",2514.94]
[null,"d. Yleisaineiden opettajat "]
["043346"," - ylempi korkeakoulututkinto tai ylempi AMK-tutkinto (46 - 48)",null,2221.02," -",2328.14,2166.33," -",2267.77]
["043341","- alempi korkeakoulututkinto (41 - 43)",null,2012," -",2086.6,1966.32," -",2038.97]
[]
["2. Musiikin perusopetus "]
["043449","a. Ylempi korkeakoulututkinto tai ylempi AMK-tutkinto (49 - 51)",null,2501.27," -",2650.44,2434.23," -",2577.34]
["043448","b. Soveltuva ammattikorkea-",null,2328.14," -",2558.89,2267.77," -",2488.7399999999998]
["043444","c. Muu soveltuva tutkinto (44 - 46)",null,2128.39," -",2221.02,2078.2600000000002," -",2166.33]
[]
["PÄÄTOIMISET TUNTIOPETTAJAT"]
[]
["042543","a. Ylempi korkeakoulututkinto tai ylempi AMK-tutkinto (43 - 45)",null,2117.12," -",2205.7600000000002,2068.79," -",2152.85]
["042542","b. Soveltuva ammattikorkeakoulututkinto, konservatorion jatkotutkinto tai entinen lehtorin kelpoisuus (42 - 44)",null,2077.9499999999998," -",2159.5100000000002,2030.5," -",2108.66]
["042539","c. Muu soveltuva tutkinto (39 - 41)",null,1975.04," -",2041.41,1930.52," -",1995.08]
[null,"d. Yleisaineet "]
["042543","- ylempi korkeakoulututkinto tai ylempi AMK-tutkinto (43 - 45)",null,2117.12," -",2205.7600000000002,2068.79," -",2152.85]
["042538","- korkeakoulututkinto (38 - 40)",null,1946.8," -",2007.56,1903.13," -",1961.9]
[]
["SIVUTOIMISET TUNTIOPETTAJAT "]
[]
[null,null,null,"per tunti",null,"kk:ssa"]
[null,"Ylempi korkeakoulututkinto tai ylempi AMK-tutkinto (42)",null,27.75,null,80.959999999999994]
[null,"Soveltuva ammattikorkeakoulututkinto, konservatorion jatkotutkinto tai entinen lehtorin kelpoisuus (41)",null,27.26,null,79.48]
[null,"Muu soveltuva tutkinto (38)",null,23.78,null,69.39]
["Yleisaineet "]
[null,"ylempi korkeakoulututkinto tai ylempi AMK-tutkinto (42)"]
[null,"- opv 20 t/vko - kielet, matematiikka",null,30.55,null,89.04]
[null,"- opv 25 t/vko - liikunta",null,24.44,null,71.23]
[null,"- opv 21 t/vko - muut aineet",null,29.09,null,84.8]
[null,"korkeakoulututkinto (37)"]
[null,"- opv 20 t/vko - kielet, matematiikka",null,28.12,null,82.05]
[null,"- opv 25 t/vko - liikunta",null,22.51,null,65.63]
[null,"- opv 21 t/vko - muut aineet",null,26.79,null,78.13]
[]
["KUVATAIDEKOULU SEKÄ MONITAITEELLINEN KOULU"]
[null,null,null,"I kalleusluokka ",null,null,"II kalleusluokka "]
["051054","Rehtori (54 - 60)",null,2645.56," -",3332.92,2572.94," -",3240.86]
["053442","1. Opettaja (42 - 48)",null,2040.32," -",2320.42,1993.69," -",2260.29]
["053444","2. perusopetuksen, kuvataiteen tai musiikin opettajan kelpoisuus, musiikkioppilaitoksen opettajan kelpoisuus tai asetuksen 948/1998 mukainen pedagoginen kelpoisuus",null,2121.37," -",2442.94,2071.08," -",2375.98]
[]
["Tuntipalkkiot"]
[null,"7 § 1. Tuntipalkkiot",null,24.47," -",29.58]
[null,"7 § 2. Vähintään 16 viikkotuntia opettavan tuntipalkkio",null,25.99," -",31.34]
[]
[]
["ERÄÄT AMMATILLISET OPPILAITOKSET"]
[null,null,null,"I kalleusluokka ",null,null,"II kalleusluokka "]
["061062","Rehtori (62 - 65)",null,3458.3," -",3914.67,3363.4," -",3806.89]
["061160","Apulaisrehtori (60 - 64)",null,3163.61," -",3688.35,3076.24," -",3586.78]
["061359","Aikuiskoulutusjohtaja (59 - 63)",null,3054.38," -",3534.31,2970.62," -",3437.01]
[]
["1. Lehtori (ammatilliset aineet)",null,null,"I kalleusluokka ",null,"II kalleusluokka "]
["063551","ylempi korkeakoulututkinto tai ylempi AMK-tutkinto (51)",null,2843.79,null,2765.37]
["063549","insinööri, rakennusarkkitehti, alempi korkeakoulututkinto, ammattikorkeakoulututkinto (49)",null,2628.49,null,2558.04]
["063544","ammatinopettajantutkinto  tai vastaava (44)",null,2220.0500000000002,null,2167.4]
["063545","opetusministeriön määräämät lisäopinnot suorittanut teknikko tai vastaava (45)",null,2340.15,null,2283.96]
["063541","alansa korkein muu koulutus (41)",null,2072.77,null,2023.99]
["063539","teknikon tutkinto tai vast. (39) ",null,1989.95,null,1944.96]
["     "]
["2. Lehtori (yhteiset aineet)"]
["063747","ylempi korkeakoulututkinto tai ylempi AMK-tutkinto(47)",null,2479.3000000000002,null,2417.13]
["063744","muu tutkinto (44)",null,2220.0500000000002,null,2167.4]
["3. Lehtori (liikunta ja terveystieto)"]
["063747","ylempi korkeakoulututkinto tai ylempi AMK-tutkinto (47) ",null,2479.3000000000002,null,2417.13]
["063744","muu tutkinto (44) ",null,2220.0500000000002,null,2167.4]
[]
[]
["KAUPPAOPPILAITOKSET"]
[null,null,null,"I kalleusluokka ",null,null,"II kalleusluokka "]
["071062","Rehtori (62 - 68)",null,3458.3," -",4470.9799999999996,3363.4," -",4347.8100000000004]
["071161","Apulaisrehtori (61 - 65)",null,3274.81," -",3851.48,3184.77," -",3745.43]
["071359","Aikuiskoulutusjohtaja (59 - 64)",null,3059.78," -",3694.89,2975.87," -",3593.13]
[]
[null,null,null,"I kalleusluokka ",null,"II kalleusluokka "]
["073551","Lehtori ylempi korkeakoulututkinto tai ylempi AMK-tutkinto(51)",null,2570.12,null,2499.25]
["073547","Lehtori, alempi korkeakoulututkinto tai amk-tutkinto (47)",null,2247.2399999999998,null,2190.9]
["073544","Lehtori,  muu tutkinto (44) ",null,2104.21,null,2054.27]
[]
[" "]
["SOSIAALI- JA TERVEYSALAN OPPILAITOS "]
[null,null,null,"I kalleusluokka ",null,null,"II kalleusluokka "]
["081061","Rehtori (61 - 65)",null,3328.54," -",3914.67,3237.01," -",3806.89]
["081159","Apulaisrehtori ja ",null,3084.89," -",3534.31,3000.3," -",3437.01]
["081359","aikuiskoulutusjohtaja (59 - 63)"]
[]
["Lehtori ja tuntiopettaja"]
[null,null,null,"I kalleusluokka ",null,null,"II kalleusluokka "]
["083556","1. Ylempi korkeakoulututkinto tai ylempi AMK-tutkinto (56 - 59)",null,3038.92,"-",3332.61,2955.64,"-",3241.2]
["083554","2. Muu tutkinto (54 - 57)",null,2853.88,"-",3110.03,2775.52,"-",3023.58]
[]
[]
["METSÄ- JA PUUTALOUSOPPILAITOS"]
[null,null,null,"I kalleusluokka ",null,null,"II kalleusluokka "]
["091062","Rehtori (62 - 65)",null,3512.36,"-",3975.85,3415.94,"-",3866.37]
["091161","Apulaisrehtori (61 - 63)",null,3320.09,"-",3589.56,3228.83,"-",3490.72]
["091359","Aikuiskoulutusjohtaja (59 - 60)",null,3102.08,"-",3213.04,3017.02,"-",3124.3]
[]
[null,"1. Lehtori (ammatilliset aineet)",null,"I kalleusluokka ",null,"II kalleusluokka "]
["093555","- ylempi korkeakoulututkinto (55)",null,3061.26,null,2977.16]
["093552","- soveltuva ammattikorkea- koulututkinto tai insinööri (52)",null,2739.21,null,2663.75]
["093550","- metsätalousinsinööri, puutalousinsinööri tai vastaava aikaisempi tutkinto (50)",null,2579.2800000000002,null,2508.56]
["093549","- teknikko tai opistoasteen tutkinto (49)",null,2521.17,null,2453.62]
["093547","- metsätalous-, sahateollisuus- tai levyteollisuusteknikko (47)",null,2378.2600000000002,null,2318.64]
["093545","- metsätyönopettajan koulutus (45) ",null,2189.1999999999998,null,2136.66]
[null,"2. Lehtori (yhteiset aineet)"]
["093755","- ylempi korkeakoulututkinto(55)",null,3061.26,null,2977.16]

{"sheet":"Taul2","index":1,"n_rows":125,"n_cols":27,"rows_kept":125,"cut":false,"hidden":true,"merged":[[2,13,2,19],[2,20,2,26]]}
[]
[null,null,null,null,null,null,null,null,null,null,"Onko ao. viesti vielä ajankohtainen?"]
[null,"Oppilaitosryhmät",null,"Tilastokoodit","tähän sanallinen, jos voi toisessa alasvedossa viitata 2 sarakkeeseen = hakee sekä koodin, että sanallisen, jos ne on eri sarakkeissa",null,null,null,null,null,"Nyt kaavat käyttävät pelkästään ylituntinpalkkiokerrointa pkl 1:lle. Laita laskuriin myös pkl 2:n ylituntipalkkiokerroin mukaan!",null,null,"Kok.lis.kertoimet haetaan tästä",null,null,null,null,null,null,"Kok.lis.prosentit haetaan tästä"]
[null,"Lukio- ja perusopetus","lukio","lukio","päivitä tähän pkl 1 alarajat","päivitä tähän pkl 2 alarajat","ilman nollaa","I-paikkakuntakalleusluokka","II-paikkakuntakalleusluokka","ylituntipalkkiokerroin pkl 1","ylituntipalkkiokerroin pkl 2","ylituntipalkkiojakaja","sanallinen nimike","alle 3v","3v","5v","8v","13v","15v","20v","alle 3v","3v","5v","8v","13v","15v","20v"]
[null,"Aikuislukio ja lukion aikuislinja","aikuislukio","012151",{"$f":"'ajantasaiset palkat'!D16","v":2927.19},{"$f":"'ajantasaiset palkat'!F16","v":2846.48},{"$f":"MID(D5,2,6)","v":"12151"},{"$f":"+E5","v":2927.19},{"$f":"+F5","v":2846.48},0.82099999999999995,0.84399999999999997,1.5,"Lehtori ja opinto-ohjaaja (lukio), ylempi korkeakoulututkinto ja lukio-opetusta antavan opettajan kelpoisuus taikka aiempi vanhemman lehtorin kelpoisuus (51)",0,0.06,0.12360000000000015,0.20225200000000032,0.29843216000000039,0.29843216000000039,0.37633808960000059,0,0.06,0.06,7.0000000000000007E-2,0.08,0,0.06]
[null,"Kansanopistot","kansanopistot","012150",{"$f":"'ajantasaiset palkat'!D17","v":2814.38},{"$f":"'ajantasaiset palkat'!F17","v":2737.2},"12150",2814.38,2737.2,0.83099999999999996,0.85499999999999998,1.5,"Lehtori ja opinto-ohjaaja (lukio), perusopetusta antavan opettajan tai aiempi lukio-opetusta antavan opettajan kelpoisuus (50)",0,0.06,0.12360000000000015,0.20225200000000032,0.29843216000000039,0.29843216000000039,0.37633808960000059,0,0.06,0.06,7.0000000000000007E-2,0.08,0,0.06]
[null,"Kansalais- ja työväen opistot","kansalais","012145",{"$f":"'ajantasaiset palkat'!D18","v":2410.91},{"$f":"'ajantasaiset palkat'!F18","v":2353.0300000000002},"12145",2410.91,2353.0300000000002,0.86399999999999999,0.88500000000000001,1.5,"Lehtori ja opinto-ohjaaja (lukio), ylempi tai alempi korkeakoulututkinto (45)",0,0.06,0.12360000000000015,0.20225200000000032,0.29843216000000039,0.29843216000000039,0.37633808960000059,0,0.06,0.06,7.0000000000000007E-2,0.08,0,0.06]
[null,"Musiikkioppilaitokset","musiikki","012139",{"$f":"'ajantasaiset palkat'!D19","v":2048.3000000000002},{"$f":"'ajantasaiset palkat'!F19","v":2002.02},"12139",2048.3000000000002,2002.02,0.90800000000000003,0.93,1.5,"Lehtori ja opinto-ohjaaja (lukio), muu kuin edellä mainittu (39) ",0,0.06,0.12360000000000015,0.20225200000000032,0.29843216000000039,0.29843216000000039,0.37633808960000059,0,0.06,0.06,7.0000000000000007E-2,0.08,0,0.06]
[null,"Kuvataidekoulu sekä monitaiteellinen koulu","kuva","012249",{"$f":"'ajantasaiset palkat'!D22","v":2724.33},{"$f":"'ajantasaiset palkat'!F22","v":2651.32},"12249",2724.33,2651.32,0.83799999999999997,0.86099999999999999,1.5,"Lehtori (peruskoulu), ylempi korkeakoulututkinto ja perus-/lukio-opetusta antavan opettajan kelpoisuus tai aiempi vanhemman lehtorin kelpoisuus (49)",0,0.06,0.12360000000000015,0.20225200000000032,0.29843216000000039,0.29843216000000039,0.37633808960000059,0,0.06,0.06,7.0000000000000007E-2,0.08,0,0.06]
[null,"Eräät ammatilliset oppilaitokset","eraat","012248",{"$f":"'ajantasaiset palkat'!D23","v":2611.5300000000002},{"$f":"'ajantasaiset palkat'!F23","v":2543.84},"12248",2611.5300000000002,2543.84,0.85199999999999998,0.875,1.5,"Lehtori (peruskoulu), perusopetusta antavan opettajan tai aiempi peruskoulun/lukion opettajan kelpoisuus (48)",0,0.06,0.12360000000000015,0.20225200000000032,0.29843216000000039,0.29843216000000039,0.37633808960000059,0,0.06,0.06,7.0000000000000007E-2,0.08,0,0.06]
[null,"Kauppaoppilaitokset","kauppa","012244",{"$f":"'ajantasaiset palkat'!D24","v":2287.25},{"$f":"'ajantasaiset palkat'!F24","v":2233.0100000000002},"12244",2287.25,2233.0100000000002,0.89200000000000002,0.91300000000000003,1.5,"Lehtori (peruskoulu), ylempi korkeakoulututkinto (44)",0,0.06,0.12360000000000015,0.20225200000000032,0.29843216000000039,0.29843216000000039,0.37633808960000059,0,0.06,0.06,7.0000000000000007E-2,0.08,0,0.06]
[null,"Sosiaali- ja terveysalan oppilaitos","sote","012242",{"$f":"'ajantasaiset palkat'!D25","v":2181.1999999999998},{"$f":"'ajantasaiset palkat'!F25","v":2129.58},"12242",2181.1999999999998,2129.58,0.89900000000000002,0.92100000000000004,1.5,"Lehtori (peruskoulu), alempi korkeakoulututkinto (42)",0,0.06,0.12360000000000015,0.20225200000000032,0.29843216000000039,0.29843216000000039,0.37633808960000059,0,0.06,0.06,7.0000000000000007E-2,0.08,0,0.06]
[null,"Metsä- ja puutalousoppilaitos","metsa","012239",{"$f":"'ajantasaiset palkat'!D26","v":2048.3000000000002},{"$f":"'ajantasaiset palkat'!F26","v":2002.02},"12239",2048.3000000000002,2002.02,0.90800000000000003,0.93,1.5,"Lehtori (peruskoulu), muu kuin edellä mainittu (39)",0,0.06,0.12360000000000015,0.20225200000000032,0.29843216000000039,0.29843216000000039,0.37633808960000059,0,0.06,0.06,7.0000000000000007E-2,0.08,0,0.06]
[null,null,null,"012349",{"$f":"'ajantasaiset palkat'!D29","v":2724.33},{"$f":"'ajantasaiset palkat'!F29","v":2651.32},"12349",2724.33,2651.32,0.83799999999999997,0.86099999999999999,1.5,"Erityisopettaja ja erityisluokanopettaja, ylempi korkeakoulututkinto ja erityisopetusta antavan opettajan kelpoisuus (49)",0,0.06,0.12360000000000015,0.20225200000000032,0.29843216000000039,0.29843216000000039,0.37633808960000059,0,0.06,0.06,7.0000000000000007E-2,0.08,0,0.06]
[null,null,null,"012348",{"$f":"'ajantasaiset palkat'!D30","v":2611.5300000000002},{"$f":"'ajantasaiset palkat'!F30","v":2543.84},"12348",2611.5300000000002,2543.84,0.85199999999999998,0.875,1.5,"Erityisopettaja ja erityisluokanopettaja, alempi korkeakoulututkinto ja erityisopetusta antavan opettajan kelpoisuus (48)",0,0.06,0.12360000000000015,0.20225200000000032,0.29843216000000039,0.29843216000000039,0.37633808960000059,0,0.06,0.06,7.0000000000000007E-2,0.08,0,0.06]
[null,"Valittuna",null,"012347",{"$f":"'ajantasaiset palkat'!D31","v":2552},{"$f":"'ajantasaiset palkat'!F31","v":2488.02},"12347",2552,2488.02,0.85199999999999998,0.874,1.5,"Erityisopettaja ja erityisluokanopettaja, erityisopetusta antavan opettajan kelpoisuus taikka ylempi korkeakoulututkinto ja perus-/lukio-opetusta antavan opettajan kelpoisuus (47)",0,0.06,0.12360000000000015,0.20225200000000032,0.29843216000000039,0.29843216000000039,0.37633808960000059,0,0.06,0.06,7.0000000000000007E-2,0.08,0,0.06]
[null,"Kuvataidekoulu sekä monitaiteellinen koulu",null,"012346",{"$f":"'ajantasaiset palkat'!D32","v":2463.06},{"$f":"'ajantasaiset palkat'!F32","v":2402.4299999999998},"12346",2463.06,2402.4299999999998,0.86299999999999999,0.88500000000000001,1.5,"Erityisopettaja ja erityisluokanopettaja, perus-/lukio-opetusta antavan opettajan kelpoisuus (46)",0,0.06,0.12360000000000015,0.20225200000000032,0.29843216000000039,0.29843216000000039,0.37633808960000059,0,0.06,0.06,7.0000000000000007E-2,0.08,0,0.06]
[null,null,null,"012341",{"$f":"'ajantasaiset palkat'!D33","v":2139.48},{"$f":"'ajantasaiset palkat'!F33","v":2089.13},"12341",2139.48,2089.13,0.9,0.92200000000000004,1.5,"Erityisopettaja ja erityisluokanopettaja, muu kuin edellä mainittu (41)",0,0.06,0.12360000000000015,0.20225200000000032,0.29843216000000039,0.29843216000000039,0.37633808960000059,0,0.06,0.06,7.0000000000000007E-2,0.08,0,0.06]
[null,null,null,"012341",{"$f":"'ajantasaiset palkat'!D36","v":2139.48},{"$f":"'ajantasaiset palkat'!F36","v":2089.13},"12341",2139.48,2089.13,0.9,0.92200000000000004,1.5,"Muita määräyksiä, jos vaikeimmin kehitysvammaisten opettajalla on soveltuva vähintään opistoasteinen tutkinto (41)",0,0.06,0.12360000000000015,0.20225200000000032,0.29843216000000039,0.29843216000000039,0.37633808960000059,0,0.06,0.06,7.0000000000000007E-2,0.08,0,0.06]
[null,null,null,"012344",{"$f":"'ajantasaiset palkat'!D37","v":2287.25},{"$f":"'ajantasaiset palkat'!F37","v":2233.0100000000002},"12344",2287.25,2233.0100000000002,0.89200000000000002,0.91300000000000003,1.5,"Muita määräyksiä, jos vaikeimmin kehitysvammaisten opettajalla on soveltuva vähintään opistoasteinen tutkinto ja jos hänellä on lisäksi 35 opintoviikon erityisopinnot (44)",0,0.06,0.12360000000000015,0.20225200000000032,0.29843216000000039,0.29843216000000039,0.37633808960000059,0,0.06,0.06,7.0000000000000007E-2,0.08,0,0.06]
[null,null,null,"012449",{"$f":"'ajantasaiset palkat'!D40","v":2724.33},{"$f":"'ajantasaiset palkat'!F40","v":2651.32},"12449",2724.33,2651.32,0.83799999999999997,0.86099999999999999,1.5,"Luokanopettaja, ylempi korkeakoulututkinto, aineen opettajan kelpoisuus  sekä perus-/lukio-opetusta antavan opettajan kelpoisuus (49)",0,0.06,0.12360000000000015,0.20225200000000032,0.29843216000000039,0.29843216000000039,0.37633808960000059,0,0.06,0.06,7.0000000000000007E-2,0.08,0,0.06]
[null,null,null,"012448",{"$f":"'ajantasaiset palkat'!D41","v":2611.5300000000002},{"$f":"'ajantasaiset palkat'!F41","v":2543.84},"12448",2611.5300000000002,2543.84,0.85199999999999998,0.875,1.5,"Luokanopettaja, aineenopettajan kelpoisuus ja perus/lukio-opetusta antavan opettajan kelpoisuus (48)",0,0.06,0.12360000000000015,0.20225200000000032,0.29843216000000039,0.29843216000000039,0.37633808960000059,0,0.06,0.06,7.0000000000000007E-2,0.08,0,0.06]
[null,null,null,"012446",{"$f":"'ajantasaiset palkat'!D42","v":2463.06},{"$f":"'ajantasaiset palkat'!F42","v":2402.4299999999998},"12446",2463.06,2402.4299999999998,0.86299999999999999,0.88500000000000001,1.5,"Luokanopettaja, perus/lukio-opetusta antavan opettajan kelpoisuus (46)",0,0.06,0.12360000000000015,0.20225200000000032,0.29843216000000039,0.29843216000000039,0.37633808960000059,0,0.06,0.06,7.0000000000000007E-2,0.08,0,0.06]
[null,1,null,"012435",{"$f":"'ajantasaiset palkat'!D43","v":1911.48},{"$f":"'ajantasaiset palkat'!F43","v":1868.95},"12435",1911.48,1868.95,0.92500000000000004,0.94699999999999995,1.5,"Luokanopettaja, muu kuin edellä mainittu (35)",0,0.06,0.12360000000000015,0.20225200000000032,0.29843216000000039,0.29843216000000039,0.37633808960000059,0,0.06,0.06,7.0000000000000007E-2,0.08,0,0.06]
[null,1,null,"015156",{"$f":"'ajantasaiset palkat'!D48","v":2840.92},{"$f":"'ajantasaiset palkat'!G48","v":2763.04},"15156",2840.92,2763.04,1,1,1.5,"Oppilaan ohjauksen lehtori, ylempi korkeakoulututkinto ja perus-/lukio-opetusta antavan opettajan kelpoisuus taikka aiempi vanhemman lehtorin kelpoisuus, määrävuosilisään oikeuttavaa aikaa alle 15 vuotta (56 - 59)",0,0.05,0.10249999999999999,0.15762499999999999,0.21550625000000001,0.21550625000000001,0.21550625000000001,0,0.05,0.05,0.05,0.05,0,0]
[null,null,null,"015159",{"$f":"'ajantasaiset palkat'!D49","v":3087.68},{"$f":"'ajantasaiset palkat'!G49","v":3003},"15159",3087.68,3003,1,1,1.5,"Oppilaan ohjauksen lehtori, ylempi korkeakoulututkinto ja perus-/lukio-opetusta antavan opettajan kelpoisuus taikka aiempi vanhemman lehtorin kelpoisuus, määrävuosilisään oikeuttavaa aikaa vähintään 15 vuotta (59 - 63)",0,0.05,0.10249999999999999,0.15762499999999999,0.21550625000000001,0.21550625000000001,0.21550625000000001,0,0.05,0.05,0.05,0.05,0,0]
[null,null,null,"015155",{"$f":"'ajantasaiset palkat'!D51","v":2776.7},{"$f":"'ajantasaiset palkat'!G51","v":2700.41},"15155",2776.7,2700.41,1,1,1.5,"Oppilaan ohjauksen lehtori, perus-/lukio-opetusta antavan opettajan kelpoisuus, määrävuosilisään oikeuttavaa aikaa alle 15 vuotta (55 - 58)",0,0.05,0.10249999999999999,0.15762499999999999,0.21550625000000001,0.21550625000000001,0.21550625000000001,0,0.05,0.05,0.05,0.05,0,0]
[null,"Valittu oppilaitosryhmä",null,"015158",{"$f":"'ajantasaiset palkat'!D52","v":2997.97},{"$f":"'ajantasaiset palkat'!G52","v":2915.33},"15158",2997.97,2915.33,1,1,1.5,"Oppilaan ohjauksen lehtori, perus-/lukio-opetusta antavan opettajan kelpoisuus, määrävuosilisään oikeuttavaa aikaa vähintään 15 vuotta (58 - 61)",0,0.05,0.10249999999999999,0.15762499999999999,0.21550625000000001,0.21550625000000001,0.21550625000000001,0,0.05,0.05,0.05,0.05,0,0]
[null,{"$f":"INDEX(oppilaitosryhmat,B24)","v":"Lukio- ja perusopetus"},null,"015143",{"$f":"'ajantasaiset palkat'!D54","v":1944},{"$f":"'ajantasaiset palkat'!G54","v":1899.65},"15143",1944,1899.65,1,1,1.5,"Muu kuin edellä mainittu, määrävuosilisään oikeuttavaa aikaa alle 15 vuotta (43 - 50)",0,0.05,0.10249999999999999,0.15762499999999999,0.21550625000000001,0.21550625000000001,0.21550625000000001,0,0.05,0.05,0.05,0.05,0,0]
[null,null,null,"015146",{"$f":"'ajantasaiset palkat'!D55","v":2069.2399999999998},{"$f":"'ajantasaiset palkat'!G55","v":2018.28},"15146",2069.2399999999998,2018.28,1,1,1.5,"Muu kuin edellä mainittu, määrävuosilisään oikeuttavaa aikaa vähintään 15 vuotta (46 - 53)",0,0.05,0.10249999999999999,0.15762499999999999,0.21550625000000001,0.21550625000000001,0.21550625000000001,0,0.05,0.05,0.05,0.05,0,0]
[null,"Valittu tilastokoodi",null,"aikuislukio",null,null,"ikuisl",0,0,{"$f":"+G31","v":"ikuisl"},{"$f":"+J31","v":"ikuisl"},1.5,{"$f":"+K31","v":"ikuisl"},1,1,1,1,1,1,1]
[null,{"$f":"INDEX(oppryh,Taul2!$B$24)","v":"lukio"},null,"012151",{"$f":"'ajantasaiset palkat'!D63","v":2927.19},{"$f":"'ajantasaiset palkat'!F63","v":2846.48},"12151",2927.19,2846.48,0.82099999999999995,0.84399999999999997,1.5,"Aikuislukion lehtori, ylempi korkeakoulututkinto ja lukio-opetusta antavan opettajan kelpoisuus taikka aiempi vanhemman lehtorin kelpoisuus (51)",0,0.06,0.12360000000000015,0.20225200000000032,0.29843216000000039,0.29843216000000039,0.37633808960000059,0,0.06,0.06,7.0000000000000007E-2,0.08,0,0.06]
[null,{"$f":"INDEX(INDIRECT(INDEX(oppryh,Taul2!$B$24)),B25)","v":"012151"},null,"012150",{"$f":"'ajantasaiset palkat'!D64","v":2814.38},{"$f":"'ajantasaiset palkat'!F64","v":2737.2},"12150",2814.38,2737.2,0.83099999999999996,0.85499999999999998,1.5,"Aikuislukion lehtori, perusopetusta antavan opettajan tai aiempi lukio-opetusta antavan opettajan kelpoisuus (50)",0,0.06,0.12360000000000015,0.20225200000000032,0.29843216000000039,0.29843216000000039,0.37633808960000059,0,0.06,0.06,7.0000000000000007E-2,0.08,0,0.06]
["tässä ilman nollaa",{"$f":"+MID(B33,2,6)","v":"12151"},null,"012145",{"$f":"'ajantasaiset palkat'!D65","v":2410.91},{"$f":"'ajantasaiset palkat'!F65","v":2353.0300000000002},"12145",2410.91,2353.0300000000002,0.86399999999999999,0.88500000000000001,1.5,"Aikuislukion lehtori, ylempi tai alempi korkeakoulututkinto (45)",0,0.06,0.12360000000000015,0.20225200000000032,0.29843216000000039,0.29843216000000039,0.37633808960000059,0,0.06,0.06,7.0000000000000007E-2,0.08,0,0.06]
[null,"PKL",null,"012139",{"$f":"'ajantasaiset palkat'!D66","v":2048.3000000000002},{"$f":"'ajantasaiset palkat'!F66","v":2002.02},"12139",2048.3000000000002,2002.02,0.90800000000000003,0.93,1.5,"Aikuislukion lehtori, muu kuin edellä mainittu (39)",0,0.06,0.12360000000000015,0.20225200000000032,0.29843216000000039,0.29843216000000039,0.37633808960000059,0,0.06,0.06,7.0000000000000007E-2,0.08,0,0.06]
[null,1,null,"kansanopistot",null,null,"ansano",0,0,{"$f":"+G36","v":"ansano"},{"$f":"+J36","v":"ansano"},0,{"$f":"+K36","v":"ansano"},1,1,1,1,1,1,1]
[null,null,null,"022650",{"$f":"'ajantasaiset palkat'!D75","v":2516.92},{"$f":"'ajantasaiset palkat'!F75","v":2447.91},"22650",2516.92,2447.91,0.94899999999999995,0.97599999999999998,0,"Opettaja, ylempi korkeakoulututkinto (50)",0,0.05,0.11300000000000021,0.19091000000000036,0.2742737000000004,0.2742737000000004,0.35073012200000053,0,0.05,0.06,7.0000000000000007E-2,7.0000000000000007E-2,0,0.06]
[null,"Peruspalkka alarajalla",null,"022645",{"$f":"'ajantasaiset palkat'!D76","v":2177.9699999999998},{"$f":"'ajantasaiset palkat'!F76","v":2125.6999999999998},"22645",2177.9699999999998,2125.6999999999998,0.94599999999999995,1,0,"Opettaja, opetustoimen henkilöstön kelpoisuusvaatimuksista annetun asetuksen 18 §:ssä tarkoitettu muu kelpoisuus 27 §:n siirtymäsäännös huomioiden tai erivapauden nojalla vapaan sivistystyön opettajan kelpoisuuden saanut henkilö (45)",0,0.05,0.11300000000000021,0.19091000000000036,0.2742737000000004,0.2742737000000004,0.35073012200000053,0,0.05,0.06,7.0000000000000007E-2,7.0000000000000007E-2,0,0.06]
[null,{"$f":"VLOOKUP(B34,G5:I84,B36+1,FALSE)","v":2927.19},null,"kansalais",null,null,"ansala",0,0,{"$f":"+G39","v":"ansala"},{"$f":"+J39","v":"ansala"},0,{"$f":"+K39","v":"ansala"},1,1,1,1,1,1,1]
[null,null,null,"022650",{"$f":"'ajantasaiset palkat'!D121","v":2516.92},{"$f":"'ajantasaiset palkat'!F121","v":2447.91},"22650",2516.92,2447.91,1,1,0,"Opettaja, ylempi korkeakoulututkinto (50)",0,0.05,0.11300000000000021,0.19091000000000036,0.2742737000000004,0.2742737000000004,0.35073012200000053,0,0.05,0.06,7.0000000000000007E-2,7.0000000000000007E-2,0,0.06]
[null,"OPV",null,"022645",{"$f":"'ajantasaiset palkat'!D122","v":2177.9699999999998},{"$f":"'ajantasaiset palkat'!F122","v":2125.6999999999998},"22645",2177.9699999999998,2125.6999999999998,1,1,0,"Opettaja, toimeen soveltuva alempi korkeakoulututkinto, ammattikorkeakoulututkinto tai opistoasteen tutkinto tai erivapauden nojalla opettajan toimeen kelpoisuuden saanut (45)",0,0.05,0.11300000000000021,0.19091000000000036,0.2742737000000004,0.2742737000000004,0.35073012200000053,0,0.05,0.06,7.0000000000000007E-2,7.0000000000000007E-2,0,0.06]
[null,{"$f":"+Laskuri!O23","v":19},null,"musiikki",null,null,{"$f":"MID(D42,2,6)","v":"usiikk"},{"$f":"+E42","v":0},{"$f":"+F42","v":0},{"$f":"+G42","v":"usiikk"},{"$f":"+J42","v":"usiikk"},0,{"$f":"+K42","v":"usiikk"},1,1,1,1,1,1,1]
[null,"Ylitunnin kk-hinta",null,"043152",{"$f":"'ajantasaiset palkat'!D199","v":2712.43},{"$f":"'ajantasaiset palkat'!G199","v":2637.67},"43152",2712.43,2637.67,1,1,0,"Konservatorion yliopettaja (52 - 54)",0,0.05,0.11300000000000021,0.19091000000000036,0.2861828000000004,0.2861828000000004,0.32476828400000035,0,0.05,0.06,7.0000000000000007E-2,0.08,0,0.03]
["yt jakaja",{"$f":"+VLOOKUP(B34,G5:L84,6,FALSE)","v":1.5},null,"043249",{"$f":"'ajantasaiset palkat'!D200","v":2501.27},{"$f":"'ajantasaiset palkat'!G200","v":2434.23},"43249",2501.27,2434.23,1,1,0,"Konservatorion lehtori - ylempi KK tai ylempi AMK-tutkinto (49 - 51)",0,0.05,0.11300000000000021,0.19091000000000036,0.2861828000000004,0.2861828000000004,0.32476828400000035,0,0.05,0.06,7.0000000000000007E-2,0.08,0,0.03]
["yt kerroin",{"$f":"VLOOKUP(B34,G5:K84,B36+3,FALSE)","v":0.82099999999999995},null,"043248",{"$f":"'ajantasaiset palkat'!D201","v":2328.14},{"$f":"'ajantasaiset palkat'!G201","v":2267.77},"43248",2328.14,2267.77,1,1,0,"Konservatorion lehtori (48 - 50)",0,0.05,0.11300000000000021,0.19091000000000036,0.2861828000000004,0.2861828000000004,0.32476828400000035,0,0.05,0.06,7.0000000000000007E-2,0.08,0,0.03]
[null,{"$f":"((Laskuri!O29+B79+B80+B81+B82)*B122)/(B42-B44)","v":137.32702799999998},null,"043346",{"$f":"'ajantasaiset palkat'!D203","v":2221.02},{"$f":"'ajantasaiset palkat'!G203","v":2166.33},"43346",2221.02,2166.33,1,1,0,"Konservatorion yleisaineiden opettaja, ylempi korkeakoulututkinto tai ylempi AMK-tutkinto (46 - 48)",0,0.05,0.11300000000000021,0.19091000000000036,0.2861828000000004,0.2861828000000004,0.32476828400000035,0,0.05,0.06,7.0000000000000007E-2,0.08,0,0.03]
[null,"Prosentuaalinen lisä",null,"043341",{"$f":"'ajantasaiset palkat'!D204","v":2012},{"$f":"'ajantasaiset palkat'!G204","v":1966.32},"43341",2012,1966.32,1,1,0,"Konservatorion yleisaineiden opettaja, alempi korkeakoulututkinto (41 - 43)",0,0.05,0.11300000000000021,0.19091000000000036,0.2861828000000004,0.2861828000000004,0.32476828400000035,0,0.05,0.06,7.0000000000000007E-2,0.08,0,0.03]
[null,{"$f":"+Laskuri!#REF!","v":{"$error":"#REF!"}},null,"043449",{"$f":"'ajantasaiset palkat'!D207","v":2501.27},{"$f":"'ajantasaiset palkat'!G207","v":2434.23},"43449",2501.27,2434.23,1,1,0,"Musiikin perusopetuksen opettaja, ylempi korkeakoulututkinto tai ylempi AMK-tutkinto (49 - 51)",0,0.05,0.11300000000000021,0.19091000000000036,0.2861828000000004,0.2861828000000004,0.32476828400000035,0,0.05,0.06,7.0000000000000007E-2,0.08,0,0.03]
[null,null,null,"043448",{"$f":"'ajantasaiset palkat'!D208","v":2328.14},{"$f":"'ajantasaiset palkat'!G208","v":2267.77},"43448",2328.14,2267.77,1,1,0,"Musiikin perusopetuksen opettaja, soveltuva ammattikorkeakoulututkinto, konservatorion jatkotutkinto tai entinen lehtorin kelpoisuus (48 - 50)",0,0.05,0.11300000000000021,0.19091000000000036,0.2861828000000004,0.2861828000000004,0.32476828400000035,0,0.05,0.06,7.0000000000000007E-2,0.08,0,0.03]
[null,"Pros.lisä euroina",null,"043444",{"$f":"'ajantasaiset palkat'!D209","v":2128.39},{"$f":"'ajantasaiset palkat'!G209","v":2078.2600000000002},"43444",2128.39,2078.2600000000002,1,1,0,"Musiikin perusopetuksen opettaja, muu soveltuva tutkinto (44 - 46)",0,0.05,0.11300000000000021,0.19091000000000036,0.2861828000000004,0.2861828000000004,0.32476828400000035,0,0.05,0.06,7.0000000000000007E-2,0.08,0,0.03]
[null,{"$f":"+B48*B39","v":{"$error":"#REF!"}},null,"042543",{"$f":"'ajantasaiset palkat'!D213","v":2117.12},{"$f":"'ajantasaiset palkat'!G213","v":2068.79},"42543",2117.12,2068.79,1,1,0,"Päätoiminen tuntiopettaja, ylempi korkeakoulututkinto tai ylempi AMK-tutkinto (43 - 45)",0,0.05,0.11300000000000021,0.19091000000000036,0.2861828000000004,0.2861828000000004,0.32476828400000035,0,0.05,0.06,7.0000000000000007E-2,0.08,0,0.03]
[null,null,null,"042542",{"$f":"'ajantasaiset palkat'!D214","v":2077.9499999999998},{"$f":"'ajantasaiset palkat'!G214","v":2030.5},"42542",2077.9499999999998,2030.5,1,1,0,"Päätoiminen tuntiopettaja, soveltuva ammattikorkeakoulututkinto, konservatorion jatkotutkinto tai entinen lehtorin kelpoisuus (42 - 44)",0,0.05,0.11300000000000021,0.19091000000000036,0.2861828000000004,0.2861828000000004,0.32476828400000035,0,0.05,0.06,7.0000000000000007E-2,0.08,0,0.03]
[null,"Tehtäväkoht. Lisä",null,"042539",{"$f":"'ajantasaiset palkat'!D215","v":1975.04},{"$f":"'ajantasaiset palkat'!G215","v":1930.52},"42539",1975.04,1930.52,1,1,0,"Päätoiminen tuntiopettaja, muu soveltuva tutkinto (39 - 41)",0,0.05,0.11300000000000021,0.19091000000000036,0.2861828000000004,0.2861828000000004,0.32476828400000035,0,0.05,0.06,7.0000000000000007E-2,0.08,0,0.03]
[null,{"$f":"+Laskuri!O20","v":0},null,"042543",{"$f":"'ajantasaiset palkat'!D217","v":2117.12},{"$f":"'ajantasaiset palkat'!G217","v":2068.79},"42543",2117.12,2068.79,1,1,0,"Päätoiminen tuntiopettaja, yleisaineet, ylempi korkeakoulututkinto tai ylempi AMK-tutkinto (43 - 45)",0,0.05,0.11300000000000021,0.19091000000000036,0.2861828000000004,0.2861828000000004,0.32476828400000035,0,0.05,0.06,7.0000000000000007E-2,0.08,0,0.03]
[null,null,null,"042538",{"$f":"'ajantasaiset palkat'!D218","v":1946.8},{"$f":"'ajantasaiset palkat'!G218","v":1903.13},"42538",1946.8,1903.13,1,1,0,"Päätoiminen tuntiopettaja, yleisaineet, korkeakoulututkinto (38 - 40)",0,0.05,0.11300000000000021,0.19091000000000036,0.2861828000000004,0.2861828000000004,0.32476828400000035,0,0.05,0.06,7.0000000000000007E-2,0.08,0,0.03]
[null,"Kokemuslisäkerroin",null,"kuva",null,null,"uva",0,0,{"$f":"+G56","v":"uva"},{"$f":"+J56","v":"uva"},0,{"$f":"+K56","v":"uva"},1,1,1,1,1,1,1]
[null,{"$f":"VLOOKUP(B34,G5:T84,7+C89,FALSE)","v":0},null,"053442",{"$f":"'ajantasaiset palkat'!D239","v":2040.32},{"$f":"'ajantasaiset palkat'!G239","v":1993.69},"53442",2040.32,1993.69,1,1,0,"Opettaja (42 - 48)",0,0.05,0.10250000000000004,0.15762500000000013,0.25023500000000021,0.25023500000000021,0.2877420500000003,0,0.05,0.05,0.05,0.08,0,0.03]
[null,{"$f":"+B57*Laskuri!O29","v":0},null,"053444",{"$f":"'ajantasaiset palkat'!D240","v":2121.37},{"$f":"'ajantasaiset palkat'!G240","v":2071.08},"53444",2121.37,2071.08,1,1,0,"Opettaja, perusopetuksen, kuvataiteen tai musiikin opettajan kelpoisuus, musiikkioppilaitoksen opettajan kelpoisuus tai asetuksen 948/1998 mukainen pedagoginen kelpoisuus",0,0.05,0.10250000000000004,0.15762500000000013,0.25023500000000021,0.25023500000000021,0.2877420500000003,0,0.05,0.05,0.05,0.08,0,0.03]
[null,null,null,"eraat",null,null,"raat",0,0,{"$f":"+G59","v":"raat"},{"$f":"+J59","v":"raat"},0,{"$f":"+K59","v":"raat"},1,1,1,1,1,1,1]
[null,"Epäpätevyysalennus",null,"063551",{"$f":"'ajantasaiset palkat'!D254","v":2843.79},{"$f":"'ajantasaiset palkat'!F254","v":2765.37},"63551",2843.79,2765.37,1,1,0,"Lehtori (ammatilliset aineet), ylempi korkeakoulututkinto tai ylempi AMK-tutkinto (51)",0,0.05,0.10250000000000004,0.20172500000000015,0.26181125000000027,0.33751992500000028,0.41777112050000031,0,0.05,0.05,0.09,0.05,0.06,0.06]
[null,{"$f":"+Laskuri!N21","v":0},null,"063549",{"$f":"'ajantasaiset palkat'!D255","v":2628.49},{"$f":"'ajantasaiset palkat'!F255","v":2558.04},"63549",2628.49,2558.04,1,1,0,"Lehtori (ammatilliset aineet), insinööri, rakennusarkkitehti, alempi korkeakoulututkinto, ammattikorkeakoulututkinto (49)",0,0.05,0.10250000000000004,0.20172500000000015,0.26181125000000027,0.33751992500000028,0.41777112050000031,0,0.05,0.05,0.09,0.05,0.06,0.06]
[null,{"$f":"+B61*-1","v":0},null,"063544",{"$f":"'ajantasaiset palkat'!D256","v":2220.0500000000002},{"$f":"'ajantasaiset palkat'!F256","v":2167.4},"63544",2220.0500000000002,2167.4,1,1,0,"Lehtori (ammatilliset aineet), ammatinopettajantutkinto  tai vastaava (44)",0,0.05,0.10250000000000004,0.20172500000000015,0.26181125000000027,0.33751992500000028,0.41777112050000031,0,0.05,0.05,0.09,0.05,0.06,0.06]
[null,{"$f":"+B62*B39","v":0},null,"063545",{"$f":"'ajantasaiset palkat'!D257","v":2340.15},{"$f":"'ajantasaiset palkat'!F257","v":2283.96},"63545",2340.15,2283.96,1,1,0,"Lehtori (ammatilliset aineet), opetusministeriön määräämät lisäopinnot suorittanut teknikko tai vastaava (45)",0,0.05,0.10250000000000004,0.20172500000000015,0.26181125000000027,0.33751992500000028,0.41777112050000031,0,0.05,0.05,0.09,0.05,0.06,0.06]
[null,null,null,"063541",{"$f":"'ajantasaiset palkat'!D258","v":2072.77},{"$f":"'ajantasaiset palkat'!F258","v":2023.99},"63541",2072.77,2023.99,1,1,0,"Lehtori (ammatilliset aineet), alansa korkein muu koulutus (41)",0,0.05,0.10250000000000004,0.20172500000000015,0.26181125000000027,0.33751992500000028,0.41777112050000031,0,0.05,0.05,0.09,0.05,0.06,0.06]
[null,null,null,"063539",{"$f":"'ajantasaiset palkat'!D259","v":1989.95},{"$f":"'ajantasaiset palkat'!F259","v":1944.96},"63539",1989.95,1944.96,1,1,0,"Lehtori (ammatilliset aineet), teknikon tutkinto tai vast. (39) ",0,0.05,0.10250000000000004,0.20172500000000015,0.26181125000000027,0.33751992500000028,0.41777112050000031,0,0.05,0.05,0.09,0.05,0.06,0.06]
[null,0.03,null,"063747",{"$f":"'ajantasaiset palkat'!D262","v":2479.3000000000002},{"$f":"'ajantasaiset palkat'!F262","v":2417.13},"63747",2479.3000000000002,2417.13,1,1,0,"Lehtori (yhteiset aineet), ylempi korkeakoulututkinto tai ylempi AMK-tutkinto (47)",0,0.05,0.10250000000000004,0.20172500000000015,0.26181125000000027,0.33751992500000028,0.41777112050000031,0,0.05,0.05,0.09,0.05,0.06,0.06]
[null,"pätevyyslisät",null,"063744",{"$f":"'ajantasaiset palkat'!D263","v":2220.0500000000002},{"$f":"'ajantasaiset palkat'!F263","v":2167.4},"63744",2220.0500000000002,2167.4,1,1,0,"Lehtori (yhteiset aineet), muu tutkinto (44)",0,0.05,0.10250000000000004,0.20172500000000015,0.26181125000000027,0.33751992500000028,0.41777112050000031,0,0.05,0.05,0.09,0.05,0.06,0.06]
["erkka",false,{"$f":"IF(B68=TRUE,0.22,)","v":0},"063747",{"$f":"'ajantasaiset palkat'!D265","v":2479.3000000000002},{"$f":"'ajantasaiset palkat'!F265","v":2417.13},"63747",2479.3000000000002,2417.13,1,1,0,"Lehtori (liikunta ja terveystieto), ylempi korkeakoulututkinto tai ylempi AMK-tutkinto (47) ",0,0.05,0.10250000000000004,0.20172500000000015,0.26181125000000027,0.33751992500000028,0.41777112050000031,0,0.05,0.05,0.09,0.05,0.06,0.06]
["luki",false,{"$f":"IF(B69=TRUE,0.06,)","v":0},"063744",{"$f":"'ajantasaiset palkat'!D266","v":2220.0500000000002},{"$f":"'ajantasaiset palkat'!F266","v":2167.4},"63744",2220.0500000000002,2167.4,1,1,0,"Lehtori (liikunta ja terveystieto), muu tutkinto (44) ",0,0.05,0.10250000000000004,0.20172500000000015,0.26181125000000027,0.33751992500000028,0.41777112050000031,0,0.05,0.05,0.09,0.05,0.06,0.06]
["opo",false,{"$f":"IF(B70=TRUE,B73,)","v":0},"kauppa",null,null,"auppa",0,0,{"$f":"+G70","v":"auppa"},{"$f":"+J70","v":"auppa"},0,{"$f":"+K70","v":"auppa"},1,1,1,1,1,1,1]
["viittoma",false,{"$f":"IF(B71=TRUE,0.03,)","v":0},"073551",{"$f":"'ajantasaiset palkat'!D276","v":2570.12},{"$f":"'ajantasaiset palkat'!F276","v":2499.25},"73551",2570.12,2499.25,1,1,0,"Lehtori ylempi korkeakoulututkinto tai ylempi AMK-tutkinto (51)",0,7.0000000000000007E-2,0.14490000000000003,0.2250430000000001,0.32304644000000016,0.32304644000000016,0.40242922640000023,0,7.0000000000000007E-2,7.0000000000000007E-2,7.0000000000000007E-2,0.08,0,0.06]
[null,null,null,"073547",{"$f":"'ajantasaiset palkat'!D277","v":2247.2399999999998},{"$f":"'ajantasaiset palkat'!F277","v":2190.9},"73547",2247.2399999999998,2190.9,1,1,0,"Lehtori, alempi korkeakoulututkinto tai amk-tutkinto (47)",0,7.0000000000000007E-2,0.14490000000000003,0.2250430000000001,0.32304644000000016,0.32304644000000016,0.40242922640000023,0,7.0000000000000007E-2,7.0000000000000007E-2,7.0000000000000007E-2,0.08,0,0.06]
["opolisän haku",{"$f":"INDEX(J104:J113,B24)","v":0.03},null,"073544",{"$f":"'ajantasaiset palkat'!D278","v":2104.21},{"$f":"'ajantasaiset palkat'!F278","v":2054.27},"73544",2104.21,2054.27,1,1,0,"Lehtori, muu tutkinto (44) ",0,7.0000000000000007E-2,0.14490000000000003,0.2250430000000001,0.32304644000000016,0.32304644000000016,0.40242922640000023,0,7.0000000000000007E-2,7.0000000000000007E-2,7.0000000000000007E-2,0.08,0,0.06]
[null,0.22,null,"sote",null,null,"ote",0,0,{"$f":"+G74","v":"ote"},{"$f":"+J74","v":"ote"},0,{"$f":"+K74","v":"ote"},1,1,1,1,1,1,1]
[null,0.06,null,"083556",{"$f":"'ajantasaiset palkat'!D289","v":3038.92},{"$f":"'ajantasaiset palkat'!G289","v":2955.64},"83556",3038.92,2955.64,1,1,0,"Lehtori ja tuntiopettaja, ylempi korkeakoulututkinto tai ylempi AMK-tutkinto (56 - 59)",0,0.05,0.11300000000000021,0.17978000000000027,0.23876900000000023,0.23876900000000023,0.28831976000000026,0,0.05,0.06,0.06,0.05,0,0.04]
[null,0.03,null,"083554",{"$f":"'ajantasaiset palkat'!D290","v":2853.88},{"$f":"'ajantasaiset palkat'!G290","v":2775.52},"83554",2853.88,2775.52,1,1,0,"Lehtori, muu tutkinto (54 - 57)",0,0.05,0.11300000000000021,0.17978000000000027,0.23876900000000023,0.23876900000000023,0.28831976000000026,0,0.05,0.06,0.06,0.05,0,0.04]
[null,0.03,null,"metsa",null,null,"etsa",0,0,{"$f":"+G77","v":"etsa"},{"$f":"+J77","v":"etsa"},0,{"$f":"+K77","v":"etsa"},1,1,1,1,1,1,1]
["euroina",null,null,"093555",{"$f":"'ajantasaiset palkat'!D300","v":3061.26},{"$f":"'ajantasaiset palkat'!F300","v":2977.16},"93555",3061.26,2977.16,1,1,0,"Lehtori (ammatilliset aineet), ylempi korkeakoulututkinto (55)",0,0.05,0.12350000000000017,0.22461500000000023,0.33483035000000028,0.33483035000000028,0.41492017100000034,0,0.05,7.0000000000000007E-2,0.09,0.09,0,0.06]
["erkka",{"$f":"+C68*Laskuri!O29","v":0},null,"093552",{"$f":"'ajantasaiset palkat'!D301","v":2739.21},{"$f":"'ajantasaiset palkat'!F301","v":2663.75},"93552",2739.21,2663.75,1,1,0,"Lehtori (ammatilliset aineet), soveltuva ammattikorkea- koulututkinto tai insinööri (52)",0,0.05,0.12350000000000017,0.22461500000000023,0.33483035000000028,0.33483035000000028,0.41492017100000034,0,0.05,7.0000000000000007E-2,0.09,0.09,0,0.06]
["luki",{"$f":"+C69*Laskuri!O29","v":0},null,"093550",{"$f":"'ajantasaiset palkat'!D302","v":2579.2800000000002},{"$f":"'ajantasaiset palkat'!F302","v":2508.56},"93550",2579.2800000000002,2508.56,1,1,0,"Lehtori (ammatilliset aineet), metsätalousinsinööri, puutalousinsinööri tai vastaava aikaisempi tutkinto (50)",0,0.05,0.12350000000000017,0.22461500000000023,0.33483035000000028,0.33483035000000028,0.41492017100000034,0,0.05,7.0000000000000007E-2,0.09,0.09,0,0.06]
["opo",{"$f":"+C70*Laskuri!O29","v":0},null,"093549",{"$f":"'ajantasaiset palkat'!D303","v":2521.17},{"$f":"'ajantasaiset palkat'!F303","v":2453.62},"93549",2521.17,2453.62,1,1,0,"Lehtori (ammatilliset aineet), teknikko tai opistoasteen tutkinto (49)",0,0.05,0.12350000000000017,0.22461500000000023,0.33483035000000028,0.33483035000000028,0.41492017100000034,0,0.05,7.0000000000000007E-2,0.09,0.09,0,0.06]
["viittoma",{"$f":"+Taul2!C71*Laskuri!O29","v":0},null,"093547",{"$f":"'ajantasaiset palkat'!D304","v":2378.2600000000002},{"$f":"'ajantasaiset palkat'!F304","v":2318.64},"93547",2378.2600000000002,2318.64,1,1,0,"Lehtori (ammatilliset aineet), metsätalous-, sahateollisuus- tai levyteollisuusteknikko (47)",0,0.05,0.12350000000000017,0.22461500000000023,0.33483035000000028,0.33483035000000028,0.41492017100000034,0,0.05,7.0000000000000007E-2,0.09,0.09,0,0.06]
[null,null,null,"093545",{"$f":"'ajantasaiset palkat'!D305","v":2189.1999999999998},{"$f":"'ajantasaiset palkat'!F305","v":2136.66},"93545",2189.1999999999998,2136.66,1,1,0,"Lehtori (ammatilliset aineet), metsätyönopettajan koulutus (45) ",0,0.05,0.12350000000000017,0.22461500000000023,0.33483035000000028,0.33483035000000028,0.41492017100000034,0,0.05,7.0000000000000007E-2,0.09,0.09,0,0.06]
[null,null,null,"093755",{"$f":"'ajantasaiset palkat'!D307","v":3061.26},{"$f":"'ajantasaiset palkat'!F307","v":2977.16},"93755",3061.26,2977.16,1,1,0,"Lehtori (yhteiset aineet), ylempi korkeakoulututkinto (55)",0,0.05,0.12350000000000017,0.22461500000000023,0.33483035000000028,0.33483035000000028,0.41492017100000034,0,0.05,7.0000000000000007E-2,0.09,0.09,0,0.06]
["kokonaispalkka ilman epäpät.alennusta",{"$f":"+Laskuri!O29+Laskuri!O30+Laskuri!O31+Laskuri!O32+Laskuri!O33+Laskuri!O34+Laskuri!O35+Laskuri!O36","v":2927.19}]
["epäpät.alennus",{"$f":"+B85*B62","v":0}]
[]
[]
[null,null,1]
[null,"kokemuslisätaulukot","alle 3 v.","3 v.","5 v.","8 v.","13 v.","15 v.","20 v."]
[null,"Lukio- ja perusopetus",0,0.06,0.06,7.0000000000000007E-2,0.08,0,0.06]
[null,"Aikuislukio ja lukion aikuislinja",0,0.06,0.06,7.0000000000000007E-2,0.08,0,0.06]
[null,"Kansanopistot",0,0.05,0.06,7.0000000000000007E-2,7.0000000000000007E-2,0,0.06]
[null,"Kansalais- ja työväen opistot",0,0.05,0.06,7.0000000000000007E-2,7.0000000000000007E-2,0,0.06]
[null,"Musiikkioppilaitokset",0,0.05,0.06,7.0000000000000007E-2,0.08,0,0.03]
[null,"Kuvataidekoulu sekä monitaiteellinen koulu",0,0.05,0.05,0.05,0.08,0,0.03]
[null,"Eräät ammatilliset oppilaitokset",0,0.05,0.05,0.09,0.05,0.06,0.06]
[null,"Kauppaoppilaitokset",0,7.0000000000000007E-2,7.0000000000000007E-2,7.0000000000000007E-2,0.08,0,0.06]
[null,"Sosiaali- ja terveysalan oppilaitos",0,0.05,0.06,0.06,0.05,0,0.04]
[null,"Metsä- ja puutalousoppilaitos",0,0.05,7.0000000000000007E-2,0.09,0.09,0,0.06]
[]
[]
[null,"kokemuslisäkertoimet","alle 3 v.","3 v.","5 v.","8 v.","13 v.","15 v.","20 v.","opolisä haetaan tästä"]
[null,"Lukio- ja perusopetus",0,{"$f":"+D91","v":0.06},{"$f":"+(E91+1)*(D104+1)-1","v":0.12360000000000015},0.20225200000000032,0.29843216000000039,0.29843216000000039,0.37633808960000059,0.03]
[null,"Aikuislukio ja lukion aikuislinja",0,0.06,0.12360000000000015,0.20225200000000032,0.29843216000000039,0.29843216000000039,0.37633808960000059,0.03]
[null,"Kansanopistot",0,0.05,0.11300000000000021,0.19091000000000036,0.2742737000000004,0.2742737000000004,0.35073012200000053,0.03]
[null,"Kansalais- ja työväen opistot",0,0.05,0.11300000000000021,0.19091000000000036,0.2742737000000004,0.2742737000000004,0.35073012200000053,0.03]
[null,"Musiikkioppilaitokset",0,0.05,0.11300000000000021,0.19091000000000036,0.2861828000000004,0.2861828000000004,0.32476828400000035,0.03]
[null,"Kuvataidekoulu sekä monitaiteellinen koulu",0,0.05,0.10250000000000004,0.15762500000000013,0.25023500000000021,0.25023500000000021,0.2877420500000003,0.03]
[null,"Eräät ammatilliset oppilaitokset",0,0.05,0.10250000000000004,0.20172500000000015,0.26181125000000027,0.33751992500000028,0.41777112050000031,0.03]
[null,"Kauppaoppilaitokset",0,7.0000000000000007E-2,0.14490000000000003,0.2250430000000001,0.32304644000000016,0.32304644000000016,0.40242922640000023,0.03]
[null,"Sosiaali- ja terveysalan oppilaitos",0,0.05,0.11300000000000021,0.17978000000000027,0.23876900000000023,0.23876900000000023,0.28831976000000026,0.04]
[null,"Metsä- ja puutalousoppilaitos",0,0.05,0.12350000000000017,0.22461500000000023,0.33483035000000028,0.33483035000000028,0.41492017100000034,0.03]
[]
[]
["eräiden erkan yt kerroin veivaus"]
[]
[null,{"$f":"B24*1","v":1}]
[null,{"$f":"IF(B118=7,1,0)","v":0}]
[null,{"$f":"IF(B125=TRUE,1,0)","v":0}]
[null,{"$f":"+B120+B119","v":0}]
[null,{"$f":"IF(B121=2,0.95,B45)","v":0.82099999999999995}]
[]
["tämä on erityisopettaja täpän merkki (eri siis kuin erkkalisä)"]
[null,false]

{"sheet":"Käyttöohje","index":2,"n_rows":29,"n_cols":13,"rows_kept":29,"cut":false,"hidden":false,"merged":[]}
[]
["Käyttöohje palkkalaskurille",null,null,null,null,null,null,null,null,null,"Sivistystyönantajat",null,"08/2015"]
[]
["Laskuri on ohjelmoitu VB (Visual Basic) -ohjelmointikielellä. Tarvitset sen käyttämiseen Microsoft Excel-ohjelman. "]
["Ohjelmassa täytyy olla asetettu makrojen käyttö sallituksi. Tarvittaessa sen saa asetettua valitsemalla Työkalut -> Makro -> Suojaus -> Normaali."]
[]
["Laskurissa pääset muuttamaan vihreällä pohjalla olevia kenttiä, oranssit sekä siniset kentät päivittyvät automaattisesti, eikä niihin tule koskea."]
[]
["Näin toimit (käy jokainen kohta läpi):"]
["1. Valitse alasvetovalikoista oppilaitosryhmä"]
["2. Valitse alasvetovalikoista tilastokoodi ja laita laatikkoon täppä, mikäli kyseessä on erityisopettaja "]
["    (HUOM! Ei erillisiä tilastokoodeja esim. eräiden ammatillisten oppilaitosten tai kauppaoppilaitosten erityisopettajille, vaan valintalaatikko)"]
["3. Valitse paikkakuntakalleusluokka"]
["4. Valitse kokemuslisien määrä (vuosia)"]
["5. Tarkista oikean palstan yläosasta, että valitut arvot ovat oikein"]
["6. Syötä tarvittaessa peruspalkka (mikäli suurempi kuin alarajan palkka) ja paina Enter"]
["7. Syötä tarvittaessa tehtäväkohtainen lisä, prosentuaalinen lisä (prosentteina!), muut mahdolliset lisät sekä epäpätevyysalennus (prosentteina!)"]
[]
["HUOM! Laskuri laskee suoraviivaisesti työehtosopimuksen vähimmäismääräysten mukaisen palkan."]
[]
["HUOM! Laskuria ei voi käyttää minkään oppilaitosryhmän rehtoreiden tai tuntiopettajien palkkojen laskentaan, "]
["eikä lainkaan kokonaistyöajassa olevien kansanopistojen tai ammattikorkeakoulujen palkkojen laskentaan!"]
[]
["HUOM! Mikäli käytät desimaalierotinta, käytä sitä, joka omassa Excel-ohjelmassasi on asetettu "]
["desimaalierottimeksi (pilkku tai piste)."]
[]
["Mikäli ohjelma ilmoittaa virheestä, kannattaa koko Excel sulkea ja avata laskuri uudelleen. Ole tarkka desimaalierottimen kanssa!"]
[]
["Laskuri löytyy alapalkista viereiseltä välilehdeltä."]

{"sheet":"Laskuri","index":3,"n_rows":37,"n_cols":15,"rows_kept":37,"cut":false,"hidden":false,"merged":[[3,12,5,18],[24,10,26,18]],"read":"row_number_cap"}
[null,"Opettajien palkkalaskuri 1.8.2015 alkaen",null,null,null,null,"Sivistystyönantajat",null,"08/2015"]
[]
[null,null,null,null,null,null,null,null,null,null,"Oppilaitosryhmä",{"$f":"+Taul2!B29","v":"Lukio- ja perusopetus"}]
[null,null,null,null,null,null,null,null,null,null,null,null,{"$f":"VLOOKUP(Taul2!B34,Taul2!G5:M84,7,FALSE)","v":"Lehtori ja opinto-ohjaaja (lukio), ylempi korkeakoulututkinto ja lukio-opetusta antavan opettajan kelpoisuus taikka aiempi vanhemman lehtorin kelpoisuus (51)"}]
[null,null,null,null,null,null,null,null,null,null,"Tilastokoodi ja nimike",{"$f":"+Taul2!B33","v":"012151"}]
[]
[null,null,null,null,null,null,null,null,null,null,null,{"$f":"INDEX(Taul2!H4:I4,Taul2!B36)","v":"I-paikkakuntakalleusluokka"}]
[]
[null,null,null,null,null,null,null,null,null,null,"Kokemuslisävuodet",{"$f":"INDEX(Taul2!C90:I90,Taul2!C89)","v":"alle 3 v."}]
[]
[]
[]
[null,null,null,null,null,null,"3 v. (5 v.)",{"$f":"VLOOKUP(Taul2!$B$34,Taul2!$G$5:$AA$84,15+2,FALSE)","v":0.06},null,null,{"$f":"+Taul2!B39","v":2927.19}]
[null,null,null,null,null,null,"5 v. (7 v.)",{"$f":"VLOOKUP(Taul2!$B$34,Taul2!$G$5:$AA$84,15+1,FALSE)","v":0.06}]
[null,null,null,null,null,null,"8 v. (10 v.)",{"$f":"VLOOKUP(Taul2!$B$34,Taul2!$G$5:$AA$84,15+3,FALSE)","v":7.0000000000000007E-2},null,null,"Syötä peruspalkka, mikäli alarajaa suurempi"]
[null,null,null,null,null,null,"13 v. (15 v.)",{"$f":"VLOOKUP(Taul2!$B$34,Taul2!$G$5:$AA$84,15+4,FALSE)","v":0.08},null,null,"Syötä ainoastaan ns. palkka-asteikon tapauksessa (esim. tilastokoodi 015156). "]
[null,null,null,null,null,null,"15 v.*",{"$f":"VLOOKUP(Taul2!$B$34,Taul2!$G$5:$AA$84,15+5,FALSE)","v":0},null,null,"Älä syötä asteikon ylärajaa suurempaa palkkaa (ylittävät osat käsitellään esimerkiksi henkilökohtaisena lisänä tms). "]
[null,null,null,null,null,null,"20 v.",{"$f":"VLOOKUP(Taul2!$B$34,Taul2!$G$5:$AA$84,15+6,FALSE)","v":0.06}]
[null,null,null,null,null,null,"* vain Eräät ammatilliset "]
[null,null,null,null,null,null,"oppilatokset",null,null,null,"Muut mahdolliset lisät (euroina)",null,null,null,0]
[null,null,null,null,null,null,"Suluissa Steiner-koulujen ",null,null,null,"Mahdollinen epäpätevyysalennus",null,null,0,{"$f":"+Taul2!B63","v":0}]
[null,null,null,null,null,null,"kokemuslisäportaat",null,null,null,"Ylituntien lukumäärä",null,null,null,0]
[null,null,null,null,null,null,null,null,null,null,"Opetusvelvollisuus",null,null,null,19]
[null,null,null,null,null,null,null,null,null,null,"Ylituntia vastaava kuukausipalkkio",null,null,null,{"$f":"+Taul2!B46","v":137.32702799999998}]
[null,null,null,null,null,null,null,null,null,null,"Yksittäiseltä ylitunnilta maksettavan palkkion saat kertomalla yllä olevan kuukausipalkkion luvulla 12 ja jakamalla saadun tulon oppilaitoksen työviikkojen lukumäärällä. Musiikkioppilaitoksissa jakajana on kuitenkin luku 35, peruskoulun opetuksen ohjauksessa luku 30 ja aikuislukioissa luku 33."]
[null," * vain Eräät ammattilliset oppilaitokset"]
[]
[]
[null,null,null,null,"Lisän määrä",null,null,null,null,null,"Peruspalkka (epäpätevyysalennuksella vähennettynä)",null,null,null,{"$f":"(MAX(K13,N15))*(1-N21)","v":2927.19}]
[null,null,null,null,{"$f":"IF(Taul2!B68=TRUE,Taul2!C68,Taul2!A72)","v":0},null,null,null,null,null,"Erityisopettajalisä",null,null,null,{"$f":"+(O29)*E30","v":0}]
[null,null,null,null,null,null,null,null,null,null,"Luki- ja klinikkaopettajan lisä",null,null,null,{"$f":"(O29)*E32","v":0}]
[null,null,null,null,{"$f":"IF(Taul2!B69=TRUE,Taul2!C69,)","v":0},null,null,null,null,null,"Oppilaanohjaajan lisä",null,null,null,{"$f":"+(O29)*E34","v":0}]
[null,null,null,null,null,null,null,null,null,null,"Viittomakielen lisä",null,null,null,{"$f":"+(O29)*E36","v":0}]
[null,null,null,null,{"$f":"IF(Taul2!B70=TRUE,Taul2!C70,)","v":0},null,null,null,null,null,"Kokemuslisät",null,null,null,{"$f":"+Taul2!B58","v":0}]
[null,null,null,null,null,null,null,null,null,null,"Muut lisät",null,null,null,{"$f":"+O20","v":0}]
[null,null,null,null,{"$f":"IF(Taul2!B71=TRUE,Taul2!C71,)","v":0},null,null,null,null,null,"Ylituntipalkkiot",null,null,null,{"$f":"+O22*O24","v":0}]
[null,null,null,null,null,null,null,null,null,null,"Yhteensä",null,null,null,{"$f":"SUM(O29:O36)","v":2927.19}]