{"text_format":"1","workbook":"xlsx","n_sheets":4,"sheets":["ajantasaiset palkat","Taul2","Käyttöohje","Laskuri"],"not_rendered":{"charts":0,"images":0,"macros":1,"external_links":0,"defined_names":18,"comments":0,"pivot_tables":0},"unopened":[],"bounds":{"document_bytes":16777216,"sheet_cells":100000,"rows_first":2000,"rows_last":500,"rows_between":2000,"halvings":0,"cell_chars":16384,"cell_head_chars":4096},"cells_cut":0,"cells_raw":0,"read":"row_number_cap","date_system":"1900"}

{"sheet":"ajantasaiset palkat","index":0,"n_rows":307,"n_cols":9,"rows_kept":307,"cut":false,"hidden":true,"merged":[[78,3,78,5],[78,6,78,8],[0,0,0,1],[5,3,5,5],[5,6,5,8],[46,3,46,5],[46,6,46,8],[58,3,58,5],[127,3,127,5],[127,6,127,8],[131,3,131,5],[131,6,131,8],[135,3,135,5],[135,6,135,8],[141,3,141,5],[141,6,141,8],[145,3,145,5],[145,6,145,8],[149,3,149,5],[149,6,149,8],[155,6,155,8],[189,3,189,5],[189,6,189,8],[236,3,236,5],[236,6,236,8],[281,3,281,5],[281,6,281,8],[293,3,293,5],[293,6,293,8],[58,6,58,8],[71,3,71,5],[71,6,71,8],[115,3,115,5],[115,6,115,8],[287,3,287,5],[287,6,287,8],[247,3,247,5],[247,6,247,8],[269,3,269,5],[269,6,269,8],[155,3,155,5]]}
["SIVISTYSTYÖNANTAJAT ry"]
["Opetushenkilöstön palkat  (muut kuin AMK)"]
["1.8.2015 lukien "]
[]
["LUKIO-OPETUS JA PERUSOPETUS"]
["Tilastokoodi",null,null,"I kalleusluokka ",null,null,"II kalleusluokka "]
["011064","Peruskoulun rehtori (64 - 68)",null,3718.33,"-",4426.71,3615.93,"-",4304.7700000000004]
["011065","Lukion rehtori (65 - 70)",null,3875.9,"-",4861.28,3769.19,"-",4727.54]
[]
[null,null,null,"I kalleusluokka ",null,"II kalleusluokka "]
["011261","Johtaja (61)",null,3239.88,null,3150.8]
["011259","Johtaja (59)",null,3027.13,null,2944.12]
["011154","Apulaisjohtaja (54)",null,2488.81,null,2420.4699999999998]
[]
["1. Lehtori ja opinto-ohjaaja(lukio)",null,null,"I kalleusluokka ",null,"II kalleusluokka "]
["012151","a. Ylempi korkeakoulututkinto ja lukio-opetusta antavan \nopettajan kelpoisuus taikka aiempi vanhemman lehtorin kelpoisuus (51)",null,2927.19,null,2846.48]
["012150","b. Perusopetusta antavan opettajan tai aiempi lukio-opetusta \nantavan opettajan kelpoisuus (50)",null,2814.38,null,2737.2]
["012145","c. Ylempi tai alempi korkeakoulututkinto (45)",null,2410.91,null,2353.0300000000002]
["012139","d. Muu kuin edellä mainittu (39) ",null,2048.3000000000002,null,2002.02]
["                                                       "]
["2. Lehtori (peruskoulu)"]
["012249","a. Ylempi korkeakoulututkinto ja perus-/lukio-opetusta antavan\n opettajan kelpoisuus tai aiempi vanhemman lehtorin kelpoisuus (49)",null,2724.33,null,2651.32]
["012248","b. Perusopetusta antavan opettajan tai aiempi peruskoulun/lukion opettajan kelpoisuus (48)",null,2611.5300000000002,null,2543.84]
["012244","c. Ylempi korkeakoulututkinto (44)",null,2287.25,null,2233.0100000000002]
["012242","d. Alempi korkeakoulututkinto (42)",null,2181.1999999999998,null,2129.58]
["012239","e. Muu kuin edellä mainittu (39)",null,2048.3000000000002,null,2002.02]
[]
["3. Erityisopettaja ja erityisluokanopettaja"]
["012349","a. Ylempi korkeakoulututkinto ja erityisopetusta antavan opettajan kelpoisuus (49)",null,2724.33,null,2651.32]
["012348","b. Alempi korkeakoulututkinto ja erityisopetusta antavan opettajan kelpoisuus (48)",null,2611.5300000000002,null,2543.84]
{"$rows_left_out":278}
{"sheet":"Taul2","index":1,"n_rows":125,"n_cols":27,"rows_kept":125,"cut":false,"hidden":true,"merged":[[2,13,2,19],[2,20,2,26]]}
[]
[null,null,null,null,null,null,null,null,null,null,"Onko ao. viesti vielä ajankohtainen?"]
[null,"Oppilaitosryhmät",null,"Tilastokoodit","tähän sanallinen, jos voi toisessa alasvedossa viitata 2 sarakkeeseen = hakee sekä koodin, että sanallisen, jos ne on eri sarakkeissa",null,null,null,null,null,"Nyt kaavat käyttävät pelkästään ylituntinpalkkiokerrointa pkl 1:lle. Laita laskuriin myös pkl 2:n ylituntipalkkiokerroin mukaan!",null,null,"Kok.lis.kertoimet haetaan tästä",null,null,null,null,null,null,"Kok.lis.prosentit haetaan tästä"]
[null,"Lukio- ja perusopetus","lukio","lukio","päivitä tähän pkl 1 alarajat","päivitä tähän pkl 2 alarajat","ilman nollaa","I-paikkakuntakalleusluokka","II-paikkakuntakalleusluokka","ylituntipalkkiokerroin pkl 1","ylituntipalkkiokerroin pkl 2","ylituntipalkkiojakaja","sanallinen nimike","alle 3v","3v","5v","8v","13v","15v","20v","alle 3v","3v","5v","8v","13v","15v","20v"]
[null,"Aikuislukio ja lukion aikuislinja","aikuislukio","012151",{"$f":"'ajantasaiset palkat'!D16","v":2927.19},{"$f":"'ajantasaiset palkat'!F16","v":2846.48},{"$f":"MID(D5,2,6)","v":"12151"},{"$f":"+E5","v":2927.19},{"$f":"+F5","v":2846.48},0.82099999999999995,0.84399999999999997,1.5,"Lehtori ja opinto-ohjaaja (lukio), ylempi korkeakoulututkinto ja lukio-opetusta antavan opettajan kelpoisuus taikka aiempi vanhemman lehtorin kelpoisuus (51)",0,0.06,0.12360000000000015,0.20225200000000032,0.29843216000000039,0.29843216000000039,0.37633808960000059,0,0.06,0.06,7.0000000000000007E-2,0.08,0,0.06]
[null,"Kansanopistot","kansanopistot","012150",{"$f":"'ajantasaiset palkat'!D17","v":2814.38},{"$f":"'ajantasaiset palkat'!F17","v":2737.2},"12150",2814.38,2737.2,0.83099999999999996,0.85499999999999998,1.5,"Lehtori ja opinto-ohjaaja (lukio), perusopetusta antavan opettajan tai aiempi lukio-opetusta antavan opettajan kelpoisuus (50)",0,0.06,0.12360000000000015,0.20225200000000032,0.29843216000000039,0.29843216000000039,0.37633808960000059,0,0.06,0.06,7.0000000000000007E-2,0.08,0,0.06]
[null,"Kansalais- ja työväen opistot","kansalais","012145",{"$f":"'ajantasaiset palkat'!D18","v":2410.91},{"$f":"'ajantasaiset palkat'!F18","v":2353.0300000000002},"12145",2410.91,2353.0300000000002,0.86399999999999999,0.88500000000000001,1.5,"Lehtori ja opinto-ohjaaja (lukio), ylempi tai alempi korkeakoulututkinto (45)",0,0.06,0.12360000000000015,0.20225200000000032,0.29843216000000039,0.29843216000000039,0.37633808960000059,0,0.06,0.06,7.0000000000000007E-2,0.08,0,0.06]
[null,"Musiikkioppilaitokset","musiikki","012139",{"$f":"'ajantasaiset palkat'!D19","v":2048.3000000000002},{"$f":"'ajantasaiset palkat'!F19","v":2002.02},"12139",2048.3000000000002,2002.02,0.90800000000000003,0.93,1.5,"Lehtori ja opinto-ohjaaja (lukio), muu kuin edellä mainittu (39) ",0,0.06,0.12360000000000015,0.20225200000000032,0.29843216000000039,0.29843216000000039,0.37633808960000059,0,0.06,0.06,7.0000000000000007E-2,0.08,0,0.06]
[null,"Kuvataidekoulu sekä monitaiteellinen koulu","kuva","012249",{"$f":"'ajantasaiset palkat'!D22","v":2724.33},{"$f":"'ajantasaiset palkat'!F22","v":2651.32},"12249",2724.33,2651.32,0.83799999999999997,0.86099999999999999,1.5,"Lehtori (peruskoulu), ylempi korkeakoulututkinto ja perus-/lukio-opetusta antavan opettajan kelpoisuus tai aiempi vanhemman lehtorin kelpoisuus (49)",0,0.06,0.12360000000000015,0.20225200000000032,0.29843216000000039,0.29843216000000039,0.37633808960000059,0,0.06,0.06,7.0000000000000007E-2,0.08,0,0.06]
[null,"Eräät ammatilliset oppilaitokset","eraat","012248",{"$f":"'ajantasaiset palkat'!D23","v":2611.5300000000002},{"$f":"'ajantasaiset palkat'!F23","v":2543.84},"12248",2611.5300000000002,2543.84,0.85199999999999998,0.875,1.5,"Lehtori (peruskoulu), perusopetusta antavan opettajan tai aiempi peruskoulun/lukion opettajan kelpoisuus (48)",0,0.06,0.12360000000000015,0.20225200000000032,0.29843216000000039,0.29843216000000039,0.37633808960000059,0,0.06,0.06,7.0000000000000007E-2,0.08,0,0.06]
[null,"Kauppaoppilaitokset","kauppa","012244",{"$f":"'ajantasaiset palkat'!D24","v":2287.25},{"$f":"'ajantasaiset palkat'!F24","v":2233.0100000000002},"12244",2287.25,2233.0100000000002,0.89200000000000002,0.91300000000000003,1.5,"Lehtori (peruskoulu), ylempi korkeakoulututkinto (44)",0,0.06,0.12360000000000015,0.20225200000000032,0.29843216000000039,0.29843216000000039,0.37633808960000059,0,0.06,0.06,7.0000000000000007E-2,0.08,0,0.06]
[null,"Sosiaali- ja terveysalan oppilaitos","sote","012242",{"$f":"'ajantasaiset palkat'!D25","v":2181.1999999999998},{"$f":"'ajantasaiset palkat'!F25","v":2129.58},"12242",2181.1999999999998,2129.58,0.89900000000000002,0.92100000000000004,1.5,"Lehtori (peruskoulu), alempi korkeakoulututkinto (42)",0,0.06,0.12360000000000015,0.20225200000000032,0.29843216000000039,0.29843216000000039,0.37633808960000059,0,0.06,0.06,7.0000000000000007E-2,0.08,0,0.06]
[null,"Metsä- ja puutalousoppilaitos","metsa","012239",{"$f":"'ajantasaiset palkat'!D26","v":2048.3000000000002},{"$f":"'ajantasaiset palkat'!F26","v":2002.02},"12239",2048.3000000000002,2002.02,0.90800000000000003,0.93,1.5,"Lehtori (peruskoulu), muu kuin edellä mainittu (39)",0,0.06,0.12360000000000015,0.20225200000000032,0.29843216000000039,0.29843216000000039,0.37633808960000059,0,0.06,0.06,7.0000000000000007E-2,0.08,0,0.06]
[null,null,null,"012349",{"$f":"'ajantasaiset palkat'!D29","v":2724.33},{"$f":"'ajantasaiset palkat'!F29","v":2651.32},"12349",2724.33,2651.32,0.83799999999999997,0.86099999999999999,1.5,"Erityisopettaja ja erityisluokanopettaja, ylempi korkeakoulututkinto ja erityisopetusta antavan opettajan kelpoisuus (49)",0,0.06,0.12360000000000015,0.20225200000000032,0.29843216000000039,0.29843216000000039,0.37633808960000059,0,0.06,0.06,7.0000000000000007E-2,0.08,0,0.06]
[null,null,null,"012348",{"$f":"'ajantasaiset palkat'!D30","v":2611.5300000000002},{"$f":"'ajantasaiset palkat'!F30","v":2543.84},"12348",2611.5300000000002,2543.84,0.85199999999999998,0.875,1.5,"Erityisopettaja ja erityisluokanopettaja, alempi korkeakoulututkinto ja erityisopetusta antavan opettajan kelpoisuus (48)",0,0.06,0.12360000000000015,0.20225200000000032,0.29843216000000039,0.29843216000000039,0.37633808960000059,0,0.06,0.06,7.0000000000000007E-2,0.08,0,0.06]
[null,"Valittuna",null,"012347",{"$f":"'ajantasaiset palkat'!D31","v":2552},{"$f":"'ajantasaiset palkat'!F31","v":2488.02},"12347",2552,2488.02,0.85199999999999998,0.874,1.5,"Erityisopettaja ja erityisluokanopettaja, erityisopetusta antavan opettajan kelpoisuus taikka ylempi korkeakoulututkinto ja perus-/lukio-opetusta antavan opettajan kelpoisuus (47)",0,0.06,0.12360000000000015,0.20225200000000032,0.29843216000000039,0.29843216000000039,0.37633808960000059,0,0.06,0.06,7.0000000000000007E-2,0.08,0,0.06]
[null,"Kuvataidekoulu sekä monitaiteellinen koulu",null,"012346",{"$f":"'ajantasaiset palkat'!D32","v":2463.06},{"$f":"'ajantasaiset palkat'!F32","v":2402.4299999999998},"12346",2463.06,2402.4299999999998,0.86299999999999999,0.88500000000000001,1.5,"Erityisopettaja ja erityisluokanopettaja, perus-/lukio-opetusta antavan opettajan kelpoisuus (46)",0,0.06,0.12360000000000015,0.20225200000000032,0.29843216000000039,0.29843216000000039,0.37633808960000059,0,0.06,0.06,7.0000000000000007E-2,0.08,0,0.06]
[null,null,null,"012341",{"$f":"'ajantasaiset palkat'!D33","v":2139.48},{"$f":"'ajantasaiset palkat'!F33","v":2089.13},"12341",2139.48,2089.13,0.9,0.92200000000000004,1.5,"Erityisopettaja ja erityisluokanopettaja, muu kuin edellä mainittu (41)",0,0.06,0.12360000000000015,0.20225200000000032,0.29843216000000039,0.29843216000000039,0.37633808960000059,0,0.06,0.06,7.0000000000000007E-2,0.08,0,0.06]
[null,null,null,"012341",{"$f":"'ajantasaiset palkat'!D36","v":2139.48},{"$f":"'ajantasaiset palkat'!F36","v":2089.13},"12341",2139.48,2089.13,0.9,0.92200000000000004,1.5,"Muita määräyksiä, jos vaikeimmin kehitysvammaisten opettajalla on soveltuva vähintään opistoasteinen tutkinto (41)",0,0.06,0.12360000000000015,0.20225200000000032,0.29843216000000039,0.29843216000000039,0.37633808960000059,0,0.06,0.06,7.0000000000000007E-2,0.08,0,0.06]
[null,null,null,"012344",{"$f":"'ajantasaiset palkat'!D37","v":2287.25},{"$f":"'ajantasaiset palkat'!F37","v":2233.0100000000002},"12344",2287.25,2233.0100000000002,0.89200000000000002,0.91300000000000003,1.5,"Muita määräyksiä, jos vaikeimmin kehitysvammaisten opettajalla on soveltuva vähintään opistoasteinen tutkinto ja jos hänellä on lisäksi 35 opintoviikon erityisopinnot (44)",0,0.06,0.12360000000000015,0.20225200000000032,0.29843216000000039,0.29843216000000039,0.37633808960000059,0,0.06,0.06,7.0000000000000007E-2,0.08,0,0.06]
[null,null,null,"012449",{"$f":"'ajantasaiset palkat'!D40","v":2724.33},{"$f":"'ajantasaiset palkat'!F40","v":2651.32},"12449",2724.33,2651.32,0.83799999999999997,0.86099999999999999,1.5,"Luokanopettaja, ylempi korkeakoulututkinto, aineen opettajan kelpoisuus  sekä perus-/lukio-opetusta antavan opettajan kelpoisuus (49)",0,0.06,0.12360000000000015,0.20225200000000032,0.29843216000000039,0.29843216000000039,0.37633808960000059,0,0.06,0.06,7.0000000000000007E-2,0.08,0,0.06]
[null,null,null,"012448",{"$f":"'ajantasaiset palkat'!D41","v":2611.5300000000002},{"$f":"'ajantasaiset palkat'!F41","v":2543.84},"12448",2611.5300000000002,2543.84,0.85199999999999998,0.875,1.5,"Luokanopettaja, aineenopettajan kelpoisuus ja perus/lukio-opetusta antavan opettajan kelpoisuus (48)",0,0.06,0.12360000000000015,0.20225200000000032,0.29843216000000039,0.29843216000000039,0.37633808960000059,0,0.06,0.06,7.0000000000000007E-2,0.08,0,0.06]
[null,null,null,"012446",{"$f":"'ajantasaiset palkat'!D42","v":2463.06},{"$f":"'ajantasaiset palkat'!F42","v":2402.4299999999998},"12446",2463.06,2402.4299999999998,0.86299999999999999,0.88500000000000001,1.5,"Luokanopettaja, perus/lukio-opetusta antavan opettajan kelpoisuus (46)",0,0.06,0.12360000000000015,0.20225200000000032,0.29843216000000039,0.29843216000000039,0.37633808960000059,0,0.06,0.06,7.0000000000000007E-2,0.08,0,0.06]
[null,1,null,"012435",{"$f":"'ajantasaiset palkat'!D43","v":1911.48},{"$f":"'ajantasaiset palkat'!F43","v":1868.95},"12435",1911.48,1868.95,0.92500000000000004,0.94699999999999995,1.5,"Luokanopettaja, muu kuin edellä mainittu (35)",0,0.06,0.12360000000000015,0.20225200000000032,0.29843216000000039,0.29843216000000039,0.37633808960000059,0,0.06,0.06,7.0000000000000007E-2,0.08,0,0.06]
[null,1,null,"015156",{"$f":"'ajantasaiset palkat'!D48","v":2840.92},{"$f":"'ajantasaiset palkat'!G48","v":2763.04},"15156",2840.92,2763.04,1,1,1.5,"Oppilaan ohjauksen lehtori, ylempi korkeakoulututkinto ja perus-/lukio-opetusta antavan opettajan kelpoisuus taikka aiempi vanhemman lehtorin kelpoisuus, määrävuosilisään oikeuttavaa aikaa alle 15 vuotta (56 - 59)",0,0.05,0.10249999999999999,0.15762499999999999,0.21550625000000001,0.21550625000000001,0.21550625000000001,0,0.05,0.05,0.05,0.05,0,0]
[null,null,null,"015159",{"$f":"'ajantasaiset palkat'!D49","v":3087.68},{"$f":"'ajantasaiset palkat'!G49","v":3003},"15159",3087.68,3003,1,1,1.5,"Oppilaan ohjauksen lehtori, ylempi korkeakoulututkinto ja perus-/lukio-opetusta antavan opettajan kelpoisuus taikka aiempi vanhemman lehtorin kelpoisuus, määrävuosilisään oikeuttavaa aikaa vähintään 15 vuotta (59 - 63)",0,0.05,0.10249999999999999,0.15762499999999999,0.21550625000000001,0.21550625000000001,0.21550625000000001,0,0.05,0.05,0.05,0.05,0,0]
[null,null,null,"015155",{"$f":"'ajantasaiset palkat'!D51","v":2776.7},{"$f":"'ajantasaiset palkat'!G51","v":2700.41},"15155",2776.7,2700.41,1,1,1.5,"Oppilaan ohjauksen lehtori, perus-/lukio-opetusta antavan opettajan kelpoisuus, määrävuosilisään oikeuttavaa aikaa alle 15 vuotta (55 - 58)",0,0.05,0.10249999999999999,0.15762499999999999,0.21550625000000001,0.21550625000000001,0.21550625000000001,0,0.05,0.05,0.05,0.05,0,0]
[null,"Valittu oppilaitosryhmä",null,"015158",{"$f":"'ajantasaiset palkat'!D52","v":2997.97},{"$f":"'ajantasaiset palkat'!G52","v":2915.33},"15158",2997.97,2915.33,1,1,1.5,"Oppilaan ohjauksen lehtori, perus-/lukio-opetusta antavan opettajan kelpoisuus, määrävuosilisään oikeuttavaa aikaa vähintään 15 vuotta (58 - 61)",0,0.05,0.10249999999999999,0.15762499999999999,0.21550625000000001,0.21550625000000001,0.21550625000000001,0,0.05,0.05,0.05,0.05,0,0]
[null,{"$f":"INDEX(oppilaitosryhmat,B24)","v":"Lukio- ja perusopetus"},null,"015143",{"$f":"'ajantasaiset palkat'!D54","v":1944},{"$f":"'ajantasaiset palkat'!G54","v":1899.65},"15143",1944,1899.65,1,1,1.5,"Muu kuin edellä mainittu, määrävuosilisään oikeuttavaa aikaa alle 15 vuotta (43 - 50)",0,0.05,0.10249999999999999,0.15762499999999999,0.21550625000000001,0.21550625000000001,0.21550625000000001,0,0.05,0.05,0.05,0.05,0,0]
[null,null,null,"015146",{"$f":"'ajantasaiset palkat'!D55","v":2069.2399999999998},{"$f":"'ajantasaiset palkat'!G55","v":2018.28},"15146",2069.2399999999998,2018.28,1,1,1.5,"Muu kuin edellä mainittu, määrävuosilisään oikeuttavaa aikaa vähintään 15 vuotta (46 - 53)",0,0.05,0.10249999999999999,0.15762499999999999,0.21550625000000001,0.21550625000000001,0.21550625000000001,0,0.05,0.05,0.05,0.05,0,0]
{"$rows_left_out":96}
{"sheet":"Käyttöohje","index":2,"n_rows":29,"n_cols":13,"rows_kept":29,"cut":false,"hidden":false,"merged":[]}
[]
["Käyttöohje palkkalaskurille",null,null,null,null,null,null,null,null,null,"Sivistystyönantajat",null,"08/2015"]
[]
["Laskuri on ohjelmoitu VB (Visual Basic) -ohjelmointikielellä. Tarvitset sen käyttämiseen Microsoft Excel-ohjelman. "]
["Ohjelmassa täytyy olla asetettu makrojen käyttö sallituksi. Tarvittaessa sen saa asetettua valitsemalla Työkalut -> Makro -> Suojaus -> Normaali."]
[]
["Laskurissa pääset muuttamaan vihreällä pohjalla olevia kenttiä, oranssit sekä siniset kentät päivittyvät automaattisesti, eikä niihin tule koskea."]
[]
["Näin toimit (käy jokainen kohta läpi):"]
["1. Valitse alasvetovalikoista oppilaitosryhmä"]
["2. Valitse alasvetovalikoista tilastokoodi ja laita laatikkoon täppä, mikäli kyseessä on erityisopettaja "]
["    (HUOM! Ei erillisiä tilastokoodeja esim. eräiden ammatillisten oppilaitosten tai kauppaoppilaitosten erityisopettajille, vaan valintalaatikko)"]
["3. Valitse paikkakuntakalleusluokka"]
["4. Valitse kokemuslisien määrä (vuosia)"]
["5. Tarkista oikean palstan yläosasta, että valitut arvot ovat oikein"]
["6. Syötä tarvittaessa peruspalkka (mikäli suurempi kuin alarajan palkka) ja paina Enter"]
["7. Syötä tarvittaessa tehtäväkohtainen lisä, prosentuaalinen lisä (prosentteina!), muut mahdolliset lisät sekä epäpätevyysalennus (prosentteina!)"]
[]
["HUOM! Laskuri laskee suoraviivaisesti työehtosopimuksen vähimmäismääräysten mukaisen palkan."]
[]
["HUOM! Laskuria ei voi käyttää minkään oppilaitosryhmän rehtoreiden tai tuntiopettajien palkkojen laskentaan, "]
["eikä lainkaan kokonaistyöajassa olevien kansanopistojen tai ammattikorkeakoulujen palkkojen laskentaan!"]
[]
["HUOM! Mikäli käytät desimaalierotinta, käytä sitä, joka omassa Excel-ohjelmassasi on asetettu "]
["desimaalierottimeksi (pilkku tai piste)."]
[]
["Mikäli ohjelma ilmoittaa virheestä, kannattaa koko Excel sulkea ja avata laskuri uudelleen. Ole tarkka desimaalierottimen kanssa!"]
[]
["Laskuri löytyy alapalkista viereiseltä välilehdeltä."]

{"sheet":"Laskuri","index":3,"n_rows":37,"n_cols":15,"rows_kept":37,"cut":false,"hidden":false,"merged":[[3,12,5,18],[24,10,26,18]],"read":"row_number_cap"}
[null,"Opettajien palkkalaskuri 1.8.2015 alkaen",null,null,null,null,"Sivistystyönantajat",null,"08/2015"]
[]
[null,null,null,null,null,null,null,null,null,null,"Oppilaitosryhmä",{"$f":"+Taul2!B29","v":"Lukio- ja perusopetus"}]
[null,null,null,null,null,null,null,null,null,null,null,null,{"$f":"VLOOKUP(Taul2!B34,Taul2!G5:M84,7,FALSE)","v":"Lehtori ja opinto-ohjaaja (lukio), ylempi korkeakoulututkinto ja lukio-opetusta antavan opettajan kelpoisuus taikka aiempi vanhemman lehtorin kelpoisuus (51)"}]
[null,null,null,null,null,null,null,null,null,null,"Tilastokoodi ja nimike",{"$f":"+Taul2!B33","v":"012151"}]
[]
[null,null,null,null,null,null,null,null,null,null,null,{"$f":"INDEX(Taul2!H4:I4,Taul2!B36)","v":"I-paikkakuntakalleusluokka"}]
[]
[null,null,null,null,null,null,null,null,null,null,"Kokemuslisävuodet",{"$f":"INDEX(Taul2!C90:I90,Taul2!C89)","v":"alle 3 v."}]
[]
[]
[]
[null,null,null,null,null,null,"3 v. (5 v.)",{"$f":"VLOOKUP(Taul2!$B$34,Taul2!$G$5:$AA$84,15+2,FALSE)","v":0.06},null,null,{"$f":"+Taul2!B39","v":2927.19}]
[null,null,null,null,null,null,"5 v. (7 v.)",{"$f":"VLOOKUP(Taul2!$B$34,Taul2!$G$5:$AA$84,15+1,FALSE)","v":0.06}]
[null,null,null,null,null,null,"8 v. (10 v.)",{"$f":"VLOOKUP(Taul2!$B$34,Taul2!$G$5:$AA$84,15+3,FALSE)","v":7.0000000000000007E-2},null,null,"Syötä peruspalkka, mikäli alarajaa suurempi"]
[null,null,null,null,null,null,"13 v. (15 v.)",{"$f":"VLOOKUP(Taul2!$B$34,Taul2!$G$5:$AA$84,15+4,FALSE)","v":0.08},null,null,"Syötä ainoastaan ns. palkka-asteikon tapauksessa (esim. tilastokoodi 015156). "]
[null,null,null,null,null,null,"15 v.*",{"$f":"VLOOKUP(Taul2!$B$34,Taul2!$G$5:$AA$84,15+5,FALSE)","v":0},null,null,"Älä syötä asteikon ylärajaa suurempaa palkkaa (ylittävät osat käsitellään esimerkiksi henkilökohtaisena lisänä tms). "]
[null,null,null,null,null,null,"20 v.",{"$f":"VLOOKUP(Taul2!$B$34,Taul2!$G$5:$AA$84,15+6,FALSE)","v":0.06}]
[null,null,null,null,null,null,"* vain Eräät ammatilliset "]
[null,null,null,null,null,null,"oppilatokset",null,null,null,"Muut mahdolliset lisät (euroina)",null,null,null,0]
[null,null,null,null,null,null,"Suluissa Steiner-koulujen ",null,null,null,"Mahdollinen epäpätevyysalennus",null,null,0,{"$f":"+Taul2!B63","v":0}]
[null,null,null,null,null,null,"kokemuslisäportaat",null,null,null,"Ylituntien lukumäärä",null,null,null,0]
[null,null,null,null,null,null,null,null,null,null,"Opetusvelvollisuus",null,null,null,19]
[null,null,null,null,null,null,null,null,null,null,"Ylituntia vastaava kuukausipalkkio",null,null,null,{"$f":"+Taul2!B46","v":137.32702799999998}]
[null,null,null,null,null,null,null,null,null,null,"Yksittäiseltä ylitunnilta maksettavan palkkion saat kertomalla yllä olevan kuukausipalkkion luvulla 12 ja jakamalla saadun tulon oppilaitoksen työviikkojen lukumäärällä. Musiikkioppilaitoksissa jakajana on kuitenkin luku 35, peruskoulun opetuksen ohjauksessa luku 30 ja aikuislukioissa luku 33."]
[null," * vain Eräät ammattilliset oppilaitokset"]
[]
[]
[null,null,null,null,"Lisän määrä",null,null,null,null,null,"Peruspalkka (epäpätevyysalennuksella vähennettynä)",null,null,null,{"$f":"(MAX(K13,N15))*(1-N21)","v":2927.19}]
[null,null,null,null,{"$f":"IF(Taul2!B68=TRUE,Taul2!C68,Taul2!A72)","v":0},null,null,null,null,null,"Erityisopettajalisä",null,null,null,{"$f":"+(O29)*E30","v":0}]
{"$rows_left_out":7}