{"text_format":"1","workbook":"xlsx","n_sheets":4,"sheets":["ajantasaiset palkat","Taul2","Käyttöohje","Laskuri"],"not_rendered":{"charts":0,"images":0,"macros":1,"external_links":0,"defined_names":18,"comments":0,"pivot_tables":0},"unopened":[],"bounds":{"document_bytes":16777216,"sheet_cells":100000,"rows_first":2000,"rows_last":500,"rows_between":2000,"halvings":0,"cell_chars":16384,"cell_head_chars":4096},"cells_cut":0,"cells_raw":0,"read":"row_number_cap","date_system":"1900"}

{"sheet":"ajantasaiset palkat","index":0,"n_rows":339,"n_cols":9,"rows_kept":339,"cut":false,"hidden":true,"merged":[[301,3,301,5],[301,6,301,8],[185,3,185,5],[185,6,185,8],[193,3,193,5],[193,6,193,8],[201,3,201,5],[201,6,201,8],[279,3,279,5],[279,6,279,8],[313,3,313,5],[313,6,313,8],[325,3,325,5],[325,6,325,8],[319,3,319,5],[319,6,319,8],[58,6,58,8],[71,3,71,5],[71,6,71,8],[115,3,115,5],[115,6,115,8],[78,3,78,5],[78,6,78,8],[58,3,58,5],[155,3,155,5],[155,6,155,8],[221,3,221,5],[221,6,221,8],[268,3,268,5],[268,6,268,8],[176,3,176,5],[176,6,176,8],[160,3,160,5],[160,6,160,8],[168,3,168,5],[168,6,168,8],[141,3,141,5],[141,6,141,8],[145,3,145,5],[145,6,145,8],[149,3,149,5],[149,6,149,8],[127,3,127,5],[127,6,127,8],[131,3,131,5],[131,6,131,8],[135,3,135,5],[135,6,135,8],[0,0,0,1],[5,3,5,5],[5,6,5,8],[46,3,46,5],[46,6,46,8]]}
["SIVISTYSTYÖNANTAJAT ry"]
["Opetushenkilöstön palkat  (muut kuin AMK)"]
[null,null,null,"1.5.2018 lukien"]
[]
["LUKIO-OPETUS JA PERUSOPETUS"]
["Tilastokoodi",null,null,"I kalleusluokka ",null,null,"II kalleusluokka "]
["011064","Peruskoulun rehtori (64 - 68)",null,3779.88,"-",4499.99,3675.79,"-",4376.03]
["011065","Lukion rehtori (65 - 70)",null,3940.06,"-",4941.76,3831.58,"-",4805.8]
[]
[null,null,null,"I kalleusluokka ",null,"II kalleusluokka "]
["011261","Johtaja (61)",null,3293.51,null,3202.96]
["011259","Johtaja (59)",null,3077.24,null,2992.86]
["011154","Apulaisjohtaja (54)",null,2530.0100000000002,null,2460.54]
[]
["1. Lehtori ja opinto-ohjaaja(lukio)",null,null,"I kalleusluokka ",null,"II kalleusluokka "]
["012151","a. Ylempi korkeakoulututkinto ja lukio-opetusta antavan \nopettajan kelpoisuus taikka aiempi vanhemman lehtorin kelpoisuus (51)",null,2975.64,null,2893.6]
["012150","b. Perusopetusta antavan opettajan tai aiempi lukio-opetusta \nantavan opettajan kelpoisuus (50)",null,2860.96,null,2782.51]
["012145","c. Ylempi tai alempi korkeakoulututkinto (45)",null,2450.8200000000002,null,2391.98]
["012139","d. Muu kuin edellä mainittu (39) ",null,2082.21,null,2035.16]
["                                                       "]
["2. Lehtori (peruskoulu)"]
["012249","a. Ylempi korkeakoulututkinto ja perus-/lukio-opetusta antavan\n opettajan kelpoisuus tai aiempi vanhemman lehtorin kelpoisuus (49)",null,2769.43,null,2695.21]
["012248","b. Perusopetusta antavan opettajan tai aiempi peruskoulun/lukion opettajan kelpoisuus (48)",null,2654.76,null,2585.9499999999998]
["012244","c. Ylempi korkeakoulututkinto (44)",null,2325.11,null,2269.98]
["012242","d. Alempi korkeakoulututkinto (42)",null,2217.31,null,2164.83]
["012239","e. Muu kuin edellä mainittu (39)",null,2082.21,null,2035.16]
[]
["3. Erityisopettaja ja erityisluokanopettaja"]
["012349","a. Ylempi korkeakoulututkinto ja erityisopetusta antavan opettajan kelpoisuus (49)",null,2769.43,null,2695.21]
["012348","b. Alempi korkeakoulututkinto ja erityisopetusta antavan opettajan kelpoisuus (48)",null,2654.76,null,2585.9499999999998]
["012347","c. Erityisopetusta antavan opettajan kelpoisuus taikka ylempi korkeakoulututkinto\n ja perus-/lukio-opetusta antavan opettajan kelpoisuus (47)",null,2594.2399999999998,null,2529.21]
["012346","d. Perus-/lukio-opetusta antavan opettajan kelpoisuus (46)",null,2503.83,null,2442.1999999999998]
["012341","e. Muu kuin edellä mainittu (41)",null,2174.9,null,2123.71]
[]
["f. Muita määräyksiä"]
["012341","Jos vaikeimmin kehitysvammaisten opettajalla on soveltuva\n  vähintään opistoasteinen tutkinto (41), on hänen peruspalkkansa",null,2174.9,null,2123.71]
["012344","ja jos hänellä on lisäksi 35 opintoviikon erityisopinnot (44), ",null,2325.11,null,2269.98]
[]
["4. Luokanopettaja"]
["012449","a. Ylempi korkeakoulututkinto, aineen opettajan kelpoisuus  sekä perus-/lukio-opetusta antavan opettajan kelpoisuus (49)",null,2769.43,null,2695.21]
{"$rows_left_out":300}
{"sheet":"Taul2","index":1,"n_rows":125,"n_cols":27,"rows_kept":125,"cut":false,"hidden":true,"merged":[[2,13,2,19],[2,20,2,26]]}
[]
[]
[null,"Oppilaitosryhmät",null,"Tilastokoodit","tähän sanallinen, jos voi toisessa alasvedossa viitata 2 sarakkeeseen = hakee sekä koodin, että sanallisen, jos ne on eri sarakkeissa",null,null,null,null,null,null,null,null,"Kok.lis.kertoimet haetaan tästä",null,null,null,null,null,null,"Kok.lis.prosentit haetaan tästä"]
[null,"Lukio- ja perusopetus","lukio","lukio","päivitä tähän pkl 1 alarajat","päivitä tähän pkl 2 alarajat","ilman nollaa","I-paikkakuntakalleusluokka","II-paikkakuntakalleusluokka","ylituntipalkkiokerroin pkl 1","ylituntipalkkiokerroin pkl 2","ylituntipalkkiojakaja","sanallinen nimike","alle 3v","3v","5v","8v","13v","15v","20v","alle 3v","3v","5v","8v","13v","15v","20v"]
[null,"Aikuislukio ja lukion aikuislinja","aikuislukio","012151",2975.64,2893.6,{"$f":"MID(D5,2,6)","v":"12151"},{"$f":"+E5","v":2975.64},{"$f":"+F5","v":2893.6},0.82099999999999995,0.84399999999999997,1.5,"Lehtori ja opinto-ohjaaja (lukio), ylempi korkeakoulututkinto ja lukio-opetusta antavan opettajan kelpoisuus taikka aiempi vanhemman lehtorin kelpoisuus (51)",0,0.06,0.12360000000000015,0.20225200000000032,0.29843216000000039,0.29843216000000039,0.37633808960000059,0,0.06,0.06,7.0000000000000007E-2,0.08,0,0.06]
[null,"Kansanopistot","kansanopistot","012150",2860.96,2782.51,"12150",2860.96,2782.51,0.83099999999999996,0.85499999999999998,1.5,"Lehtori ja opinto-ohjaaja (lukio), perusopetusta antavan opettajan tai aiempi lukio-opetusta antavan opettajan kelpoisuus (50)",0,0.06,0.12360000000000015,0.20225200000000032,0.29843216000000039,0.29843216000000039,0.37633808960000059,0,0.06,0.06,7.0000000000000007E-2,0.08,0,0.06]
[null,"Kansalais- ja työväen opistot","kansalais","012145",2450.8200000000002,2391.98,"12145",2450.8200000000002,2391.98,0.86399999999999999,0.88500000000000001,1.5,"Lehtori ja opinto-ohjaaja (lukio), ylempi tai alempi korkeakoulututkinto (45)",0,0.06,0.12360000000000015,0.20225200000000032,0.29843216000000039,0.29843216000000039,0.37633808960000059,0,0.06,0.06,7.0000000000000007E-2,0.08,0,0.06]
[null,"Musiikkioppilaitokset","musiikki","012139",2082.21,2035.16,"12139",2082.21,2035.16,0.90800000000000003,0.93,1.5,"Lehtori ja opinto-ohjaaja (lukio), muu kuin edellä mainittu (39) ",0,0.06,0.12360000000000015,0.20225200000000032,0.29843216000000039,0.29843216000000039,0.37633808960000059,0,0.06,0.06,7.0000000000000007E-2,0.08,0,0.06]
[null,"Kuvataidekoulu sekä monitaiteellinen koulu","kuva","012249",2769.43,2695.21,"12249",2769.43,2695.21,0.83799999999999997,0.86099999999999999,1.5,"Lehtori (peruskoulu), ylempi korkeakoulututkinto ja perus-/lukio-opetusta antavan opettajan kelpoisuus tai aiempi vanhemman lehtorin kelpoisuus (49)",0,0.06,0.12360000000000015,0.20225200000000032,0.29843216000000039,0.29843216000000039,0.37633808960000059,0,0.06,0.06,7.0000000000000007E-2,0.08,0,0.06]
[null,"Eräät ammatilliset oppilaitokset","eraat","012248",2654.76,2585.9499999999998,"12248",2654.76,2585.9499999999998,0.85199999999999998,0.875,1.5,"Lehtori (peruskoulu), perusopetusta antavan opettajan tai aiempi peruskoulun/lukion opettajan kelpoisuus (48)",0,0.06,0.12360000000000015,0.20225200000000032,0.29843216000000039,0.29843216000000039,0.37633808960000059,0,0.06,0.06,7.0000000000000007E-2,0.08,0,0.06]
[null,"Kauppaoppilaitokset","kauppa","012244",2325.11,2269.98,"12244",2325.11,2269.98,0.89200000000000002,0.91300000000000003,1.5,"Lehtori (peruskoulu), ylempi korkeakoulututkinto (44)",0,0.06,0.12360000000000015,0.20225200000000032,0.29843216000000039,0.29843216000000039,0.37633808960000059,0,0.06,0.06,7.0000000000000007E-2,0.08,0,0.06]
[null,"Sosiaali- ja terveysalan oppilaitos","sote","012242",2217.31,2164.83,"12242",2217.31,2164.83,0.89900000000000002,0.92100000000000004,1.5,"Lehtori (peruskoulu), alempi korkeakoulututkinto (42)",0,0.06,0.12360000000000015,0.20225200000000032,0.29843216000000039,0.29843216000000039,0.37633808960000059,0,0.06,0.06,7.0000000000000007E-2,0.08,0,0.06]
[null,"Metsä- ja puutalousoppilaitos","metsa","012239",2082.21,2035.16,"12239",2082.21,2035.16,0.90800000000000003,0.93,1.5,"Lehtori (peruskoulu), muu kuin edellä mainittu (39)",0,0.06,0.12360000000000015,0.20225200000000032,0.29843216000000039,0.29843216000000039,0.37633808960000059,0,0.06,0.06,7.0000000000000007E-2,0.08,0,0.06]
[null,null,null,"012349",2769.43,2695.21,"12349",2769.43,2695.21,0.83799999999999997,0.86099999999999999,1.5,"Erityisopettaja ja erityisluokanopettaja, ylempi korkeakoulututkinto ja erityisopetusta antavan opettajan kelpoisuus (49)",0,0.06,0.12360000000000015,0.20225200000000032,0.29843216000000039,0.29843216000000039,0.37633808960000059,0,0.06,0.06,7.0000000000000007E-2,0.08,0,0.06]
[null,null,null,"012348",2654.76,2585.9499999999998,"12348",2654.76,2585.9499999999998,0.85199999999999998,0.875,1.5,"Erityisopettaja ja erityisluokanopettaja, alempi korkeakoulututkinto ja erityisopetusta antavan opettajan kelpoisuus (48)",0,0.06,0.12360000000000015,0.20225200000000032,0.29843216000000039,0.29843216000000039,0.37633808960000059,0,0.06,0.06,7.0000000000000007E-2,0.08,0,0.06]
[null,"Valittuna",null,"012347",2594.2399999999998,2529.21,"12347",2594.2399999999998,2529.21,0.85199999999999998,0.874,1.5,"Erityisopettaja ja erityisluokanopettaja, erityisopetusta antavan opettajan kelpoisuus taikka ylempi korkeakoulututkinto ja perus-/lukio-opetusta antavan opettajan kelpoisuus (47)",0,0.06,0.12360000000000015,0.20225200000000032,0.29843216000000039,0.29843216000000039,0.37633808960000059,0,0.06,0.06,7.0000000000000007E-2,0.08,0,0.06]
[null,"Kuvataidekoulu sekä monitaiteellinen koulu",null,"012346",2503.83,2442.1999999999998,"12346",2503.83,2442.1999999999998,0.86299999999999999,0.88500000000000001,1.5,"Erityisopettaja ja erityisluokanopettaja, perus-/lukio-opetusta antavan opettajan kelpoisuus (46)",0,0.06,0.12360000000000015,0.20225200000000032,0.29843216000000039,0.29843216000000039,0.37633808960000059,0,0.06,0.06,7.0000000000000007E-2,0.08,0,0.06]
[null,null,null,"012341",2174.9,2123.71,"12341",2174.9,2123.71,0.9,0.92200000000000004,1.5,"Erityisopettaja ja erityisluokanopettaja, muu kuin edellä mainittu (41)",0,0.06,0.12360000000000015,0.20225200000000032,0.29843216000000039,0.29843216000000039,0.37633808960000059,0,0.06,0.06,7.0000000000000007E-2,0.08,0,0.06]
[null,null,null,"012341",2174.9,2123.71,"12341",2174.9,2123.71,0.9,0.92200000000000004,1.5,"Muita määräyksiä, jos vaikeimmin kehitysvammaisten opettajalla on soveltuva vähintään opistoasteinen tutkinto (41)",0,0.06,0.12360000000000015,0.20225200000000032,0.29843216000000039,0.29843216000000039,0.37633808960000059,0,0.06,0.06,7.0000000000000007E-2,0.08,0,0.06]
[null,null,null,"012344",2325.11,2269.98,"12344",2325.11,2269.98,0.89200000000000002,0.91300000000000003,1.5,"Muita määräyksiä, jos vaikeimmin kehitysvammaisten opettajalla on soveltuva vähintään opistoasteinen tutkinto ja jos hänellä on lisäksi 35 opintoviikon erityisopinnot (44)",0,0.06,0.12360000000000015,0.20225200000000032,0.29843216000000039,0.29843216000000039,0.37633808960000059,0,0.06,0.06,7.0000000000000007E-2,0.08,0,0.06]
[null,null,null,"012449",2769.43,2695.21,"12449",2769.43,2695.21,0.83799999999999997,0.86099999999999999,1.5,"Luokanopettaja, ylempi korkeakoulututkinto, aineen opettajan kelpoisuus  sekä perus-/lukio-opetusta antavan opettajan kelpoisuus (49)",0,0.06,0.12360000000000015,0.20225200000000032,0.29843216000000039,0.29843216000000039,0.37633808960000059,0,0.06,0.06,7.0000000000000007E-2,0.08,0,0.06]
[null,null,null,"012448",2654.76,2585.9499999999998,"12448",2654.76,2585.9499999999998,0.85199999999999998,0.875,1.5,"Luokanopettaja, aineenopettajan kelpoisuus ja perus/lukio-opetusta antavan opettajan kelpoisuus (48)",0,0.06,0.12360000000000015,0.20225200000000032,0.29843216000000039,0.29843216000000039,0.37633808960000059,0,0.06,0.06,7.0000000000000007E-2,0.08,0,0.06]
[null,null,null,"012446",2503.83,2442.1999999999998,"12446",2503.83,2442.1999999999998,0.86299999999999999,0.88500000000000001,1.5,"Luokanopettaja, perus/lukio-opetusta antavan opettajan kelpoisuus (46)",0,0.06,0.12360000000000015,0.20225200000000032,0.29843216000000039,0.29843216000000039,0.37633808960000059,0,0.06,0.06,7.0000000000000007E-2,0.08,0,0.06]
[null,1,null,"012435",1943.12,1899.89,"12435",1943.12,1899.89,0.92500000000000004,0.94699999999999995,1.5,"Luokanopettaja, muu kuin edellä mainittu (35)",0,0.06,0.12360000000000015,0.20225200000000032,0.29843216000000039,0.29843216000000039,0.37633808960000059,0,0.06,0.06,7.0000000000000007E-2,0.08,0,0.06]
[null,1,null,"015156",2887.94,2808.78,"15156",2887.94,2808.78,1,1,1.5,"Oppilaan ohjauksen lehtori, ylempi korkeakoulututkinto ja perus-/lukio-opetusta antavan opettajan kelpoisuus taikka aiempi vanhemman lehtorin kelpoisuus, määrävuosilisään oikeuttavaa aikaa alle 15 vuotta (56 - 59)",0,0.05,0.10249999999999999,0.15762499999999999,0.21550625000000001,0.21550625000000001,0.21550625000000001,0,0.05,0.05,0.05,0.05,0,0]
[null,null,null,"015159",3138.79,3052.71,"15159",3138.79,3052.71,1,1,1.5,"Oppilaan ohjauksen lehtori, ylempi korkeakoulututkinto ja perus-/lukio-opetusta antavan opettajan kelpoisuus taikka aiempi vanhemman lehtorin kelpoisuus, määrävuosilisään oikeuttavaa aikaa vähintään 15 vuotta (59 - 63)",0,0.05,0.10249999999999999,0.15762499999999999,0.21550625000000001,0.21550625000000001,0.21550625000000001,0,0.05,0.05,0.05,0.05,0,0]
[null,null,null,"015155",2822.67,2745.11,"15155",2822.67,2745.11,1,1,1.5,"Oppilaan ohjauksen lehtori, perus-/lukio-opetusta antavan opettajan kelpoisuus, määrävuosilisään oikeuttavaa aikaa alle 15 vuotta (55 - 58)",0,0.05,0.10249999999999999,0.15762499999999999,0.21550625000000001,0.21550625000000001,0.21550625000000001,0,0.05,0.05,0.05,0.05,0,0]
[null,"Valittu oppilaitosryhmä",null,"015158",3047.6,2963.59,"15158",3047.6,2963.59,1,1,1.5,"Oppilaan ohjauksen lehtori, perus-/lukio-opetusta antavan opettajan kelpoisuus, määrävuosilisään oikeuttavaa aikaa vähintään 15 vuotta (58 - 61)",0,0.05,0.10249999999999999,0.15762499999999999,0.21550625000000001,0.21550625000000001,0.21550625000000001,0,0.05,0.05,0.05,0.05,0,0]
[null,{"$f":"INDEX(oppilaitosryhmat,B24)","v":"Lukio- ja perusopetus"},null,"015143",1976.18,1931.1,"15143",1976.18,1931.1,1,1,1.5,"Muu kuin edellä mainittu, määrävuosilisään oikeuttavaa aikaa alle 15 vuotta (43 - 50)",0,0.05,0.10249999999999999,0.15762499999999999,0.21550625000000001,0.21550625000000001,0.21550625000000001,0,0.05,0.05,0.05,0.05,0,0]
[null,null,null,"015146",2103.4899999999998,2051.69,"15146",2103.4899999999998,2051.69,1,1,1.5,"Muu kuin edellä mainittu, määrävuosilisään oikeuttavaa aikaa vähintään 15 vuotta (46 - 53)",0,0.05,0.10249999999999999,0.15762499999999999,0.21550625000000001,0.21550625000000001,0.21550625000000001,0,0.05,0.05,0.05,0.05,0,0]
[null,"Valittu tilastokoodi",null,"aikuislukio",null,null,"ikuisl",0,0,{"$f":"+G31","v":"ikuisl"},{"$f":"+J31","v":"ikuisl"},1.5,{"$f":"+K31","v":"ikuisl"},1,1,1,1,1,1,1]
[null,{"$f":"INDEX(oppryh,Taul2!$B$24)","v":"lukio"},null,"012151",2975.64,2893.6,"12151",2975.64,2893.6,0.82099999999999995,0.84399999999999997,1.5,"Aikuislukion lehtori, ylempi korkeakoulututkinto ja lukio-opetusta antavan opettajan kelpoisuus taikka aiempi vanhemman lehtorin kelpoisuus (51)",0,0.06,0.12360000000000015,0.20225200000000032,0.29843216000000039,0.29843216000000039,0.37633808960000059,0,0.06,0.06,7.0000000000000007E-2,0.08,0,0.06]
[null,{"$f":"INDEX(INDIRECT(INDEX(oppryh,Taul2!$B$24)),B25)","v":"012151"},null,"012150",2860.96,2782.51,"12150",2860.96,2782.51,0.83099999999999996,0.85499999999999998,1.5,"Aikuislukion lehtori, perusopetusta antavan opettajan tai aiempi lukio-opetusta antavan opettajan kelpoisuus (50)",0,0.06,0.12360000000000015,0.20225200000000032,0.29843216000000039,0.29843216000000039,0.37633808960000059,0,0.06,0.06,7.0000000000000007E-2,0.08,0,0.06]
["tässä ilman nollaa",{"$f":"+MID(B33,2,6)","v":"12151"},null,"012145",2450.8200000000002,2391.98,"12145",2450.8200000000002,2391.98,0.86399999999999999,0.88500000000000001,1.5,"Aikuislukion lehtori, ylempi tai alempi korkeakoulututkinto (45)",0,0.06,0.12360000000000015,0.20225200000000032,0.29843216000000039,0.29843216000000039,0.37633808960000059,0,0.06,0.06,7.0000000000000007E-2,0.08,0,0.06]
[null,"PKL",null,"012139",2082.21,2035.16,"12139",2082.21,2035.16,0.90800000000000003,0.93,1.5,"Aikuislukion lehtori, muu kuin edellä mainittu (39)",0,0.06,0.12360000000000015,0.20225200000000032,0.29843216000000039,0.29843216000000039,0.37633808960000059,0,0.06,0.06,7.0000000000000007E-2,0.08,0,0.06]
[null,1,null,"kansanopistot",null,null,"ansano",0,0,{"$f":"+G36","v":"ansano"},{"$f":"+J36","v":"ansano"},0,{"$f":"+K36","v":"ansano"},1,1,1,1,1,1,1]
[null,null,null,"022650",2558.59,2488.44,"22650",2558.59,2488.44,0.94899999999999995,0.97599999999999998,0,"Opettaja, ylempi korkeakoulututkinto (50)",0,0.05,0.11300000000000021,0.19091000000000036,0.2742737000000004,0.2742737000000004,0.35073012200000053,0,0.05,0.06,7.0000000000000007E-2,7.0000000000000007E-2,0,0.06]
[null,"Peruspalkka alarajalla",null,"022645",2214.02,2160.89,"22645",2214.02,2160.89,0.94599999999999995,1,0,"Opettaja, opetustoimen henkilöstön kelpoisuusvaatimuksista annetun asetuksen 18 §:ssä tarkoitettu muu kelpoisuus 27 §:n siirtymäsäännös huomioiden tai erivapauden nojalla vapaan sivistystyön opettajan kelpoisuuden saanut henkilö (45)",0,0.05,0.11300000000000021,0.19091000000000036,0.2742737000000004,0.2742737000000004,0.35073012200000053,0,0.05,0.06,7.0000000000000007E-2,7.0000000000000007E-2,0,0.06]
[null,{"$f":"VLOOKUP(B34,G5:I84,B36+1,FALSE)","v":2975.64},null,"kansalais",null,null,"ansala",0,0,{"$f":"+G39","v":"ansala"},{"$f":"+J39","v":"ansala"},0,{"$f":"+K39","v":"ansala"},1,1,1,1,1,1,1]
[null,null,null,"022650",2558.59,2488.44,"22650",2558.59,2488.44,1,1,0,"Opettaja, ylempi korkeakoulututkinto (50)",0,0.05,0.11300000000000021,0.19091000000000036,0.2742737000000004,0.2742737000000004,0.35073012200000053,0,0.05,0.06,7.0000000000000007E-2,7.0000000000000007E-2,0,0.06]
{"$rows_left_out":86}
{"sheet":"Käyttöohje","index":2,"n_rows":29,"n_cols":13,"rows_kept":29,"cut":false,"hidden":false,"merged":[]}
[]
["Käyttöohje palkkalaskurille",null,null,null,null,null,null,null,null,null,"Sivistystyönantajat",null,"05/2018"]
[]
["Laskuri on ohjelmoitu VB (Visual Basic) -ohjelmointikielellä. Tarvitset sen käyttämiseen Microsoft Excel-ohjelman. "]
["Ohjelmassa täytyy olla asetettu makrojen käyttö sallituksi. Tarvittaessa sen saa asetettua valitsemalla Työkalut -> Makro -> Suojaus -> Normaali."]
[]
["Laskurissa pääset muuttamaan vihreällä pohjalla olevia kenttiä, oranssit sekä siniset kentät päivittyvät automaattisesti, eikä niihin tule koskea."]
[]
["Näin toimit (käy jokainen kohta läpi):"]
["1. Valitse alasvetovalikoista oppilaitosryhmä"]
["2. Valitse alasvetovalikoista tilastokoodi ja laita laatikkoon täppä, mikäli kyseessä on erityisopettaja "]
["    (HUOM! Ei erillisiä tilastokoodeja esim. eräiden ammatillisten oppilaitosten tai kauppaoppilaitosten erityisopettajille, vaan valintalaatikko)"]
["3. Valitse paikkakuntakalleusluokka"]
["4. Valitse kokemuslisien määrä (vuosia)"]
["5. Tarkista oikean palstan yläosasta, että valitut arvot ovat oikein"]
["6. Syötä tarvittaessa peruspalkka (mikäli suurempi kuin alarajan palkka) ja paina Enter"]
["7. Syötä tarvittaessa tehtäväkohtainen lisä, prosentuaalinen lisä (prosentteina!), muut mahdolliset lisät sekä epäpätevyysalennus (prosentteina!)"]
[]
["HUOM! Laskuri laskee suoraviivaisesti työehtosopimuksen vähimmäismääräysten mukaisen palkan."]
[]
["HUOM! Laskuria ei voi käyttää minkään oppilaitosryhmän rehtoreiden tai tuntiopettajien palkkojen laskentaan, "]
["eikä lainkaan kokonaistyöajassa olevien kansanopistojen tai ammattikorkeakoulujen palkkojen laskentaan!"]
[]
["HUOM! Mikäli käytät desimaalierotinta, käytä sitä, joka omassa Excel-ohjelmassasi on asetettu "]
["desimaalierottimeksi (pilkku tai piste)."]
[]
["Mikäli ohjelma ilmoittaa virheestä, kannattaa koko Excel sulkea ja avata laskuri uudelleen. Ole tarkka desimaalierottimen kanssa!"]
[]
["Laskuri löytyy alapalkista viereiseltä välilehdeltä."]

{"sheet":"Laskuri","index":3,"n_rows":37,"n_cols":15,"rows_kept":37,"cut":false,"hidden":false,"merged":[[3,12,5,18],[24,10,26,18]],"read":"row_number_cap"}
[null,"Opettajien palkkalaskuri 1.5.2018 alkaen",null,null,null,null,"Sivistystyönantajat",null,"05/2018"]
[]
[null,null,null,null,null,null,null,null,null,null,"Oppilaitosryhmä",{"$f":"+Taul2!B29","v":"Lukio- ja perusopetus"}]
[null,null,null,null,null,null,null,null,null,null,null,null,{"$f":"VLOOKUP(Taul2!B34,Taul2!G5:M84,7,FALSE)","v":"Lehtori ja opinto-ohjaaja (lukio), ylempi korkeakoulututkinto ja lukio-opetusta antavan opettajan kelpoisuus taikka aiempi vanhemman lehtorin kelpoisuus (51)"}]
[null,null,null,null,null,null,null,null,null,null,"Tilastokoodi ja nimike",{"$f":"+Taul2!B33","v":"012151"}]
[]
[null,null,null,null,null,null,null,null,null,null,null,{"$f":"INDEX(Taul2!H4:I4,Taul2!B36)","v":"I-paikkakuntakalleusluokka"}]
[]
[null,null,null,null,null,null,null,null,null,null,"Kokemuslisävuodet",{"$f":"INDEX(Taul2!C90:I90,Taul2!C89)","v":"alle 3 v."}]
[]
[]
[]
[null,null,null,null,null,null,"3 v. (5 v.)",{"$f":"VLOOKUP(Taul2!$B$34,Taul2!$G$5:$AA$84,15+1,FALSE)","v":0.06},null,null,{"$f":"+Taul2!B39","v":2975.64}]
[null,null,null,null,null,null,"5 v. (7 v.)",{"$f":"VLOOKUP(Taul2!$B$34,Taul2!$G$5:$AA$84,15+2,FALSE)","v":0.06}]
[null,null,null,null,null,null,"8 v. (10 v.)",{"$f":"VLOOKUP(Taul2!$B$34,Taul2!$G$5:$AA$84,15+3,FALSE)","v":7.0000000000000007E-2},null,null,"Syötä peruspalkka, mikäli alarajaa suurempi"]
[null,null,null,null,null,null,"13 v. (15 v.)",{"$f":"VLOOKUP(Taul2!$B$34,Taul2!$G$5:$AA$84,15+4,FALSE)","v":0.08},null,null,"Syötä ainoastaan ns. palkka-asteikon tapauksessa (esim. tilastokoodi 015156). "]
[null,null,null,null,null,null,"15 v.*",{"$f":"VLOOKUP(Taul2!$B$34,Taul2!$G$5:$AA$84,15+5,FALSE)","v":0},null,null,"Älä syötä asteikon ylärajaa suurempaa palkkaa (ylittävät osat käsitellään esimerkiksi henkilökohtaisena lisänä tms). "]
[null,null,null,null,null,null,"20 v.",{"$f":"VLOOKUP(Taul2!$B$34,Taul2!$G$5:$AA$84,15+6,FALSE)","v":0.06}]
[null,null,null,null,null,null,"* vain Eräät ammatilliset "]
[null,null,null,null,null,null,"oppilatokset",null,null,null,"Muut mahdolliset lisät (euroina)",null,null,null,0]
[null,null,null,null,null,null,"Suluissa Steiner-koulujen ",null,null,null,"Mahdollinen epäpätevyysalennus",null,null,0,{"$f":"+Taul2!B63","v":0}]
[null,null,null,null,null,null,"kokemuslisäportaat",null,null,null,"Ylituntien lukumäärä",null,null,null,0]
[null,null,null,null,null,null,null,null,null,null,"Opetusvelvollisuus",null,null,null,19]
[null,null,null,null,null,null,null,null,null,null,"Ylituntia vastaava kuukausipalkkio",null,null,null,{"$f":"+Taul2!B46","v":139.60002514285713}]
[null,null,null,null,null,null,null,null,null,null,"Yksittäiseltä ylitunnilta maksettavan palkkion saat kertomalla yllä olevan kuukausipalkkion luvulla 12 ja jakamalla saadun tulon oppilaitoksen työviikkojen lukumäärällä. Musiikkioppilaitoksissa jakajana on kuitenkin luku 35, peruskoulun opetuksen ohjauksessa luku 30 ja aikuislukioissa luku 33."]
[null," * vain Eräät ammattilliset oppilaitokset"]
[]
[]
[null,null,null,null,"Lisän määrä",null,null,null,null,null,"Peruspalkka (epäpätevyysalennuksella vähennettynä)",null,null,null,{"$f":"(MAX(K13,N15))*(1-N21)","v":2975.64}]
[null,null,null,null,{"$f":"IF(Taul2!B68=TRUE,Taul2!C68,Taul2!A72)","v":0},null,null,null,null,null,"Erityisopettajalisä",null,null,null,{"$f":"+(O29)*E30","v":0}]
[null,null,null,null,null,null,null,null,null,null,"Luki- ja klinikkaopettajan lisä",null,null,null,{"$f":"(O29)*E32","v":0}]
[null,null,null,null,{"$f":"IF(Taul2!B69=TRUE,Taul2!C69,)","v":0},null,null,null,null,null,"Oppilaanohjaajan lisä",null,null,null,{"$f":"+(O29)*E34","v":0}]
[null,null,null,null,null,null,null,null,null,null,"Viittomakielen lisä",null,null,null,{"$f":"+(O29)*E36","v":0}]
[null,null,null,null,{"$f":"IF(Taul2!B70=TRUE,Taul2!C70,)","v":0},null,null,null,null,null,"Kokemuslisät",null,null,null,{"$f":"+Taul2!B58","v":0}]
[null,null,null,null,null,null,null,null,null,null,"Muut lisät",null,null,null,{"$f":"+O20","v":0}]
[null,null,null,null,{"$f":"IF(Taul2!B71=TRUE,Taul2!C71,)","v":0},null,null,null,null,null,"Ylituntipalkkiot",null,null,null,{"$f":"+O22*O24","v":0}]
[null,null,null,null,null,null,null,null,null,null,"Yhteensä",null,null,null,{"$f":"SUM(O29:O36)","v":2975.64}]